[riscv-reports] [#7611] FAILED srpm=perl-Test-PerlTidy-20210709-alt1.src.rpm

Girar awaiter robot awaiter at gyle-riscv.office.basealt.ru
Thu Sep 23 13:42:00 MSK 2021


http://git.altlinux.org/tasks/7611/logs/events.1.1.log

2021-Sep-23 10:42:00 :: task #7611 for sisyphus_riscv64 started by recycler:
#100 build perl-Test-PerlTidy-20210709-alt1.src.rpm
./gb-remote-plant: line 31: syntax error near unexpected token `('
2021-Sep-23 10:42:00 :: [riscv64] requesting cancellation of task processing
2021-Sep-23 10:42:00 :: [riscv64] setup-remote FAILED
2021-Sep-23 10:42:00 :: task #7611 for sisyphus_riscv64 FAILED


More information about the Riscv-reports mailing list