[riscv-reports] [#13964] [test-only] FAILED (try 2) srpm=rpm-build-4.0.4.180-alt0.1.rv64.src.rpm ...

Girar awaiter robot awaiter at gyle-riscv.office.basealt.ru
Thu Dec 16 17:26:28 MSK 2021


http://git.altlinux.org/tasks/13964/logs/events.2.1.log

2021-Dec-16 09:50:41 :: test-only shared task #13964 for sisyphus_riscv64 resumed by iv:
#40 build rpm-build-4.0.4.180-alt0.1.rv64.src.rpm
#100 removed
#200 build service-0.5.33-alt1.src.rpm
#300 build postfix-3.6.3-alt2.src.rpm
#400 build bzip2-1.0.8-alt2.src.rpm from sisyphus_riscv64
#500 build boost-1.77.0-alt3.src.rpm
#600 build libopencolorio2.0-2.0.2-alt3.src.rpm
2021-Dec-16 09:50:48 :: created build repo
2021-Dec-16 09:51:02 :: [riscv64] #40 rpm-build-4.0.4.180-alt0.1.rv64.src.rpm: build start
2021-Dec-16 10:01:00 :: [riscv64] #40 rpm-build-4.0.4.180-alt0.1.rv64.src.rpm: build OK
2021-Dec-16 10:01:00 :: [riscv64] #200 service-0.5.33-alt1.src.rpm: build start
2021-Dec-16 10:05:22 :: [riscv64] #200 service-0.5.33-alt1.src.rpm: build OK
2021-Dec-16 10:05:22 :: [riscv64] #300 postfix-3.6.3-alt2.src.rpm: build start
2021-Dec-16 10:24:47 :: [riscv64] #300 postfix-3.6.3-alt2.src.rpm: build OK
2021-Dec-16 10:24:47 :: [riscv64] #400 bzip2-1.0.8-alt2.src.rpm: build start
2021-Dec-16 10:29:17 :: [riscv64] #400 bzip2-1.0.8-alt2.src.rpm: build OK
2021-Dec-16 10:29:18 :: [riscv64] #500 boost-1.77.0-alt3.src.rpm: build start
2021-Dec-16 14:23:04 :: [riscv64] #500 boost-1.77.0-alt3.src.rpm: build OK
2021-Dec-16 14:23:04 :: [riscv64] #600 libopencolorio2.0-2.0.2-alt3.src.rpm: build start
warning: Macro %cmake not found
warning: Macro %cmake_build not found
warning: Macro %cmakeinstall_std not found
warning: Macro %_cmake__builddir not found
Reading Package Lists...
Building Dependency Tree...
MI2a: mark cmake
MI2a:  target libarchive.so.13()(64bit)
MI2a:   mark libarchive13
MI2a:    target libcrypto.so.1.1()(64bit)
MI2a:     mark libcrypto1.1
MI2a:      target ca-certificates
MI2a:       mark ca-certificates
MI2a:        target ca-trust
MI2a:         mark ca-trust
MI2a:          target p11-kit-trust
MI2a:           mark p11-kit-trust
MI2a:            target /etc/alternatives/packages.d
MI2a:             mark alternatives
MI2a:              target rpm-macros-alternatives
MI2a:               mark rpm-macros-alternatives
MI2a:            target libtasn1.so.6()(64bit)
MI2a:             mark libtasn1
MI2a:            target libp11-kit
MI2a:             mark libp11-kit
MI2a:  target libcurl.so.4()(64bit)
MI2a:   mark libcurl
MI2a:    target libbrotlidec.so.1()(64bit)
MI2a:     mark libbrotlidec
MI2a:      target libbrotlicommon
MI2a:       mark libbrotlicommon
MI2a:    target libgssapi_krb5.so.2()(64bit)
MI2a:     mark libkrb5
MI2a:      target libcom_err.so.2()(64bit)
MI2a:       mark libcom_err
MI2a:      target libkeyutils.so.1()(64bit)
MI2a:       mark libkeyutils
MI2a:      target liblmdb.so.0()(64bit)
MI2a:       mark liblmdb
MI2a:      target libssl.so.1.1()(64bit)
MI2a:       mark libssl1.1
MI2a:      target libverto.so.1()(64bit)
MI2a:       mark libverto
MI2a:    target libidn2.so.0()(64bit)
MI2a:     mark libidn2
MI2a:    target liblber-2.4.so.2()(64bit)
MI2a:     mark libldap
MI2a:      target libsasl2.so.3()(64bit)
MI2a:       mark libsasl2-3
MI2a:      target openldap-common
MI2a:       mark openldap-common
MI2a:    target libnghttp2.so.14()(64bit)
MI2a:     mark libnghttp2
MI2a:    target libpsl.so.5()(64bit)
MI2a:     mark libpsl
MI2a:      target publicsuffix-list-dafsa
MI2a:       mark publicsuffix-list-dafsa
MI2a:  target libexpat.so.1()(64bit)
MI2a:   mark libexpat
MI2a:  target libjsoncpp.so.24()(64bit)
MI2a:   mark libjsoncpp24
MI2a:  target librhash.so.0()(64bit)
MI2a:   mark librhash
MI2a:  target libuv.so.1()(64bit)
MI2a:   mark libuv
MI2a:  target cmake-modules
MI2a:   mark cmake-modules
MI2a:  target rpm-macros-cmake
MI2a:   mark rpm-macros-cmake
MI2a: mark gcc-c++
MI2a:  target gcc10-c++
MI2a:   mark gcc10-c++
MI2a:    target libstdc++10-devel
MI2a:     mark libstdc++10-devel
MI2a:      target gcc-c++-common
MI2a:       mark gcc-c++-common
MI2a: mark help2man
MI2a:  target perl(Encode.pm)
MI2a:   mark perl-Encode
MI2a:    target perl(Filter/Util/Call.pm)
MI2a:     mark perl-Filter
MI2a:  target perl(Locale/gettext.pm)
MI2a:   mark perl-Locale-gettext
W: pkgMakeStatusCache: The configured APT::Cache-Limit (134217728) is below the recommended default value (201326592). Remove it to use the default.
W: You may want to run apt-get update to correct these problems
E: Couldn't find package libopenimageio-devel
hsh-install: Failed to calculate package file list.
hsh-install: Failed to generate package file list.
2021-Dec-16 14:26:27 :: [riscv64] libopencolorio2.0-2.0.2-alt3.src.rpm: remote: cannot build src.rpm
2021-Dec-16 14:26:27 :: [riscv64] #600 libopencolorio2.0-2.0.2-alt3.src.rpm: build FAILED
2021-Dec-16 14:26:28 :: [riscv64] requesting cancellation of task processing
2021-Dec-16 14:26:28 :: [riscv64] build FAILED
2021-Dec-16 14:26:28 :: task #13964 for sisyphus_riscv64 FAILED


More information about the Riscv-reports mailing list