[riscv-reports] [#6205] [test-only] FAILED (try 3) srpm=rpm-build-perl-0.85-alt1.src.rpm srpm=perl-5.34.0-alt1.src.rpm ...

Girar awaiter robot awaiter at gyle-riscv.office.basealt.ru
Mon Aug 30 16:43:35 MSK 2021


2021-Aug-30 13:39:27 :: test-only task #6205 for sisyphus_riscv64 resumed by iv:
#100 build rpm-build-perl-0.85-alt1.src.rpm
#200 build perl-5.34.0-alt1.src.rpm
#300 build openldap-2.4.59-alt1.src.rpm
2021-Aug-30 13:39:33 :: created build repo
2021-Aug-30 13:39:38 :: [riscv64] #100 rpm-build-perl-0.85-alt1.src.rpm: build start
2021-Aug-30 13:40:39 :: [riscv64] rpm-build-perl-0.85-alt1.src.rpm: remote: no need to rebuild
2021-Aug-30 13:40:39 :: [riscv64] #100 rpm-build-perl-0.85-alt1.src.rpm: build OK
2021-Aug-30 13:40:39 :: [riscv64] #200 perl-5.34.0-alt1.src.rpm: build start
2021-Aug-30 13:42:08 :: [riscv64] perl-5.34.0-alt1.src.rpm: remote: no need to rebuild
2021-Aug-30 13:42:08 :: [riscv64] #200 perl-5.34.0-alt1.src.rpm: build OK
2021-Aug-30 13:42:08 :: [riscv64] #300 openldap-2.4.59-alt1.src.rpm: build start
Reading Package Lists...
Building Dependency Tree...
MI2a: mark sdf
MI2a:  target perl(ctime.pl)
MI2a:   mark perl-Perl4-CoreLibs
MI2a:    target perl(sys/socket.ph)
MI2a:     mark perl-ph
MI2a: mark libsasl2-devel
MI2a:  target libsasl2-3
MI2a:   mark libsasl2-3
MI2a:    target libcrypto.so.1.1()(64bit)
MI2a:     mark libcrypto1.1
MI2a:      target ca-certificates
MI2a:       mark ca-certificates
MI2a:        target ca-trust
MI2a:         mark ca-trust
MI2a:          target p11-kit-trust
MI2a:           mark p11-kit-trust
MI2a:            target libp11-kit
MI2a:             mark libp11-kit
MI2a:            target /etc/alternatives/packages.d
MI2a:             mark alternatives
MI2a:              target rpm-macros-alternatives
MI2a:               mark rpm-macros-alternatives
MI2a:            target libtasn1.so.6()(64bit)
MI2a:             mark libtasn1
MI2a:    target libgssapi_krb5.so.2()(64bit)
MI2a:     mark libkrb5
MI2a:      target libcom_err.so.2()(64bit)
MI2a:       mark libcom_err
MI2a:      target libkeyutils.so.1()(64bit)
MI2a:       mark libkeyutils
MI2a:      target libssl.so.1.1()(64bit)
MI2a:       mark libssl1.1
MI2a:      target libverto.so.1()(64bit)
MI2a:       mark libverto
MI2a: mark libunixODBC-devel
MI2a:  target libunixODBC-devel-compat
MI2a:   mark libunixODBC-devel-compat
MI2a:    target libunixODBC2
MI2a:     mark libunixODBC2
MI2a:      target libltdl.so.7()(64bit)
MI2a:       mark libltdl7
MI2a: mark perl-devel
MI2a:  target libgdbm-devel
MI2a:   mark libgdbm-devel
MI2a:    target libgdbm
MI2a:     mark libgdbm
MI2a: mark libopenslp-devel
MI2a:  target libopenslp
MI2a:   mark libopenslp
MI2a: mark libdb4.8-devel
MI2a:  target libdb4.8
MI2a:   mark libdb4.8
MI2a: mark shtool
Starting 2
Selected version sdf#1:2.001-alt4 at 1598772754 for sdf>=2
Selected version libsasl2-devel#2.1.27-alt2.1 at 1597218057 for libsasl2-devel>=2.1.24-alt1.cvs.20090508
Selecting libltdl7-devel for 'libltdl-devel'
Investigating shtool
Package shtool has broken dep on perl(arybase.pm)
  Considering perl-base 22 as a solution to shtool 9999
Some packages could not be installed. This may mean that you have
requested an impossible situation or if you are using the unstable
distribution that some required packages have not yet been created
or been moved out of Incoming.
The following information may help to resolve the situation:

The following packages have unmet dependencies:
  shtool: Depends: perl(arybase.pm)
E: Broken packages
hsh-install: Failed to calculate package file list.
hsh-install: Failed to generate package file list.
2021-Aug-30 13:43:35 :: [riscv64] openldap-2.4.59-alt1.src.rpm: remote: cannot build src.rpm
2021-Aug-30 13:43:35 :: [riscv64] #300 openldap-2.4.59-alt1.src.rpm: build FAILED
2021-Aug-30 13:43:35 :: [riscv64] build FAILED
2021-Aug-30 13:43:35 :: task #6205 for sisyphus_riscv64 FAILED

More information about the Riscv-reports mailing list