[#344219] [test-only] p10 FAILED (try 2) libqbase.git=0.1.0-alt2 alterator-module-packages.git=0.1.1-alt1
Girar awaiter (sav)
girar-builder at altlinux.org
Tue Apr 2 17:12:37 MSK 2024
https://git.altlinux.org/tasks/344219/logs/events.2.1.log
subtask name aarch64 armh i586 ppc64le x86_64
#40 libqbase 1:08 1:26 47 1:09 54
#100 alterator-module-packages 1:23 1:46 59 1:24 53
2024-Apr-02 14:06:57 :: test-only task #344219 for p10 resumed by sav:
#40 build 0.1.0-alt2 from /people/chernigin/packages/libqbase.git fetched at 2024-Apr-02 14:02:40
#100 build 0.1.1-alt1 from /people/sav/packages/alterator-module-packages.git fetched at 2024-Apr-02 13:52:19
2024-Apr-02 14:06:58 :: created build repo
2024-Apr-02 14:06:59 :: #100: force rebuild
2024-Apr-02 14:07:00 :: [x86_64] #40 libqbase.git 0.1.0-alt2: build start
2024-Apr-02 14:07:00 :: [aarch64] #40 libqbase.git 0.1.0-alt2: build start
2024-Apr-02 14:07:00 :: [armh] #40 libqbase.git 0.1.0-alt2: build start
2024-Apr-02 14:07:00 :: [i586] #40 libqbase.git 0.1.0-alt2: build start
2024-Apr-02 14:07:00 :: [ppc64le] #40 libqbase.git 0.1.0-alt2: build start
2024-Apr-02 14:07:47 :: [i586] #40 libqbase.git 0.1.0-alt2: build OK
2024-Apr-02 14:07:47 :: [i586] #100 alterator-module-packages.git 0.1.1-alt1: build start
2024-Apr-02 14:07:54 :: [x86_64] #40 libqbase.git 0.1.0-alt2: build OK
2024-Apr-02 14:07:55 :: [x86_64] #100 alterator-module-packages.git 0.1.1-alt1: build start
2024-Apr-02 14:08:08 :: [aarch64] #40 libqbase.git 0.1.0-alt2: build OK
2024-Apr-02 14:08:08 :: [aarch64] #100 alterator-module-packages.git 0.1.1-alt1: build start
2024-Apr-02 14:08:09 :: [ppc64le] #40 libqbase.git 0.1.0-alt2: build OK
2024-Apr-02 14:08:09 :: [ppc64le] #100 alterator-module-packages.git 0.1.1-alt1: build start
2024-Apr-02 14:08:26 :: [armh] #40 libqbase.git 0.1.0-alt2: build OK
2024-Apr-02 14:08:27 :: [armh] #100 alterator-module-packages.git 0.1.1-alt1: build start
2024-Apr-02 14:08:46 :: [i586] #100 alterator-module-packages.git 0.1.1-alt1: build OK
2024-Apr-02 14:08:48 :: [x86_64] #100 alterator-module-packages.git 0.1.1-alt1: build OK
2024-Apr-02 14:09:31 :: [aarch64] #100 alterator-module-packages.git 0.1.1-alt1: build OK
2024-Apr-02 14:09:33 :: [ppc64le] #100 alterator-module-packages.git 0.1.1-alt1: build OK
2024-Apr-02 14:10:13 :: [armh] #100 alterator-module-packages.git 0.1.1-alt1: build OK
2024-Apr-02 14:10:29 :: #40: libqbase.git 0.1.0-alt2: build check OK
2024-Apr-02 14:10:41 :: #100: alterator-module-packages.git 0.1.1-alt1: build check OK
2024-Apr-02 14:10:44 :: build check OK
2024-Apr-02 14:10:49 :: noarch check OK
2024-Apr-02 14:10:52 :: plan: src +2 -1 =18812, aarch64 +5 -2 =31201, armh +5 -2 =29137, i586 +5 -2 =31574, ppc64le +5 -2 =30610, x86_64 +5 -2 =32508
#40 libqbase 0.1.0-alt1 -> 0.1.0-alt2
Thu Jan 25 2024 Michael Chernigin <chernigin at altlinux> 0.1.0-alt2
- Introduce devel package
2024-Apr-02 14:11:38 :: patched apt indices
2024-Apr-02 14:11:51 :: created next repo
2024-Apr-02 14:11:58 :: duplicate provides check OK
x86_64: NEW unmet dependencies detected:
alterator-module-packages#0.1.1-alt1:p10+344219.100.2.1 at 1712066924 alterator-entry
i586: NEW unmet dependencies detected:
alterator-module-packages#0.1.1-alt1:p10+344219.100.2.1 at 1712066922 alterator-entry
aarch64: NEW unmet dependencies detected:
alterator-module-packages#0.1.1-alt1:p10+344219.100.2.1 at 1712066965 alterator-entry
ppc64le: NEW unmet dependencies detected:
alterator-module-packages#0.1.1-alt1:p10+344219.100.2.1 at 1712066967 alterator-entry
armh: NEW unmet dependencies detected:
alterator-module-packages#0.1.1-alt1:p10+344219.100.2.1 at 1712067005 alterator-entry
ACLs of affected packages (1):
alterator-module-packages
2024-Apr-02 14:12:37 :: unmets: x86_64 +1 -0 =1, i586 +1 -0 =1, aarch64 +1 -0 =5, ppc64le +1 -0 =5, armh +1 -0 =19
2024-Apr-02 14:12:37 :: dependencies check FAILED
2024-Apr-02 14:12:37 :: task #344219 for p10 FAILED
More information about the Girar-builder-p10
mailing list