[#311240] [test-only] p10 FAILED (try 2) gem-setup.git=5.999.6-alt5 gem-foreman-puppet.git=4.0.3-alt1

Girar awaiter (pav) girar-builder at altlinux.org
Mon Dec 5 21:56:30 MSK 2022


https://git.altlinux.org/tasks/311240/logs/events.2.1.log

subtask  name                aarch64  armh    i586  ppc64le  x86_64
    #40  gem-setup                58  1:25      34     1:14      33
   #200  gem-foreman-puppet        ?     ?  failed        ?  failed

2022-Dec-05 18:55:03 :: test-only task #311240 for p10 resumed by pav:
#40 build 5.999.6-alt5 from /gears/g/gem-setup.git fetched at 2022-Dec-05 18:53:56 from sisyphus
#100 removed
#200 build 4.0.3-alt1 from /gears/g/gem-foreman-puppet.git fetched at 2022-Dec-05 18:54:32 from sisyphus
2022-Dec-05 18:55:03 :: created build repo
2022-Dec-05 18:55:04 :: [aarch64] #40 gem-setup.git 5.999.6-alt5: build start
2022-Dec-05 18:55:04 :: [ppc64le] #40 gem-setup.git 5.999.6-alt5: build start
2022-Dec-05 18:55:04 :: [armh] #40 gem-setup.git 5.999.6-alt5: build start
2022-Dec-05 18:55:04 :: [i586] #40 gem-setup.git 5.999.6-alt5: build start
2022-Dec-05 18:55:04 :: [x86_64] #40 gem-setup.git 5.999.6-alt5: build start
2022-Dec-05 18:55:37 :: [x86_64] #40 gem-setup.git 5.999.6-alt5: build OK
2022-Dec-05 18:55:37 :: [x86_64] #200 gem-foreman-puppet.git 4.0.3-alt1: build start
2022-Dec-05 18:55:38 :: [i586] #40 gem-setup.git 5.999.6-alt5: build OK
2022-Dec-05 18:55:39 :: [i586] #200 gem-foreman-puppet.git 4.0.3-alt1: build start
[x86_64] <13>Dec  5 18:55:46 rpmi: libruby-2.7.4-alt2.2.1 p10+291491.1000.21.1 1640428300 installed
[x86_64] <13>Dec  5 18:55:46 rpmi: libidn2-2.3.2-alt1 p10+281239.100.3.1 1627673251 installed
[x86_64] <13>Dec  5 18:55:46 rpmi: libgdbm-1.8.3-alt10 sisyphus+278100.1600.1.1 1626058413 installed
[x86_64] <13>Dec  5 18:55:46 rpmi: libyaml2-0.2.5-alt1 sisyphus+278391.100.1.1 1626094928 installed
[x86_64] <13>Dec  5 18:55:46 rpmi: libyaml-devel-0.2.5-alt1 sisyphus+278391.100.1.1 1626094928 installed
[x86_64] <13>Dec  5 18:55:46 rpmi: libgdbm-devel-1.8.3-alt10 sisyphus+278100.1600.1.1 1626058413 installed
[x86_64] <13>Dec  5 18:55:46 rpmi: rpm-macros-ruby-1:1.0.0-alt13 sisyphus+263592.20.7.1 1608654963 installed
[x86_64] <13>Dec  5 18:55:49 rpmi: valgrind-3.17.0-alt2 sisyphus+279814.100.1.1 1626737975 installed
[x86_64] <13>Dec  5 18:55:49 rpmi: valgrind-devel-3.17.0-alt2 sisyphus+279814.100.1.1 1626737975 installed
[x86_64] <13>Dec  5 18:55:49 rpmi: zlib-devel-1.2.12-alt3 p10+305356.100.3.1 1661238279 installed
[x86_64] <13>Dec  5 18:55:49 rpmi: libreadline-devel-7.0.3-alt3 sisyphus+278099.3700.1.1 1626030606 installed
[x86_64] <13>Dec  5 18:55:49 rpmi: groff-base-1.22.3-alt2 sisyphus+275306.100.2.1 1624538375 installed
[x86_64] <13>Dec  5 18:55:49 rpmi: libncurses-6.2.20210123-alt1 sisyphus+279621.1300.1.1 1626630601 installed
[x86_64] <13>Dec  5 18:55:49 rpmi: libtinfo-devel-6.2.20210123-alt1 sisyphus+279621.1300.1.1 1626630601 installed
[x86_64] <13>Dec  5 18:55:49 rpmi: libncurses-devel-6.2.20210123-alt1 sisyphus+279621.1300.1.1 1626630601 installed
[x86_64] <13>Dec  5 18:55:49 rpmi: libncursesw-devel-6.2.20210123-alt1 sisyphus+279621.1300.1.1 1626630601 installed
[x86_64] <13>Dec  5 18:55:49 rpmi: libffi-devel-1:3.3-alt1 sisyphus+278158.300.1.1 1626050055 installed
[x86_64] <13>Dec  5 18:55:49 rpmi: libdb4.7-devel-4.7.25-alt11 sisyphus+279812.100.2.1 1626734823 installed
[x86_64] <13>Dec  5 18:55:49 rpmi: libexpat-2.4.3-alt1 p10+293695.100.1.1 1642509078 installed
[x86_64] <13>Dec  5 18:55:49 rpmi: publicsuffix-list-dafsa-20220703-alt1 p10+303338.100.1.1 1657290596 installed
[x86_64] <13>Dec  5 18:55:49 rpmi: libpsl-0.21.1-alt2 sisyphus+279461.100.1.1 1626547547 installed
[x86_64] <13>Dec  5 18:55:49 rpmi: libnghttp2-1.41.0-alt1 sisyphus+275115.100.1.1 1624405462 installed
[x86_64] <13>Dec  5 18:55:49 rpmi: openldap-common-2.4.59-alt1 p10+282974.100.1.1 1629142498 installed
[x86_64] <13>Dec  5 18:55:49 rpmi: libbrotlicommon-1.0.9-alt2 sisyphus+278430.100.1.2 1626213212 installed
[x86_64] <13>Dec  5 18:55:49 rpmi: libbrotlidec-1.0.9-alt2 sisyphus+278430.100.1.2 1626213212 installed
[x86_64] <13>Dec  5 18:55:49 rpmi: libxxhash-0.8.0-alt2 sisyphus+277476.100.2.1 1625621312 installed
[x86_64] <13>Dec  5 18:55:49 rpmi: liblz4-1:1.9.3-alt1 sisyphus+278100.4000.1.1 1626059441 installed
[x86_64] <13>Dec  5 18:55:49 rpmi: libverto-0.3.2-alt1_1 sisyphus+279289.100.1.3 1626493868 installed
[x86_64] <13>Dec  5 18:55:49 rpmi: liblmdb-0.9.23-alt1 sisyphus+275369.100.1.2 1624493869 installed
[x86_64] <13>Dec  5 18:55:49 rpmi: libkeyutils-1.6.3-alt1 sisyphus+266061.100.1.1 1612919566 installed
[x86_64] <13>Dec  5 18:55:49 rpmi: libcom_err-1.46.2.0.16.f114-alt1 sisyphus+278100.1000.1.1 1626056805 installed
[x86_64] <13>Dec  5 18:55:49 rpmi: libedit3-3.1.20191231-alt1 sisyphus+278505.100.1.1 1626106374 installed
[x86_64] <13>Dec  5 18:55:49 rpmi: less-530-alt1 sisyphus+278268.100.1.1 1626082709 installed
[x86_64] <13>Dec  5 18:55:49 rpmi: doxygen-1:1.9.1-alt1 p10+283520.500.2.1 1629892835 installed
[x86_64] <13>Dec  5 18:55:49 rpmi: diffstat-1.64-alt1 sisyphus+278100.700.1.1 1626056683 installed
[x86_64] <13>Dec  5 18:55:49 rpmi: chrpath-0.16-alt1 sisyphus+278100.500.1.1 1626056633 installed
[x86_64] <13>Dec  5 18:55:49 rpmi: libp11-kit-0.24.1-alt1 p10+305061.100.3.1 1660573397 installed
[x86_64] <13>Dec  5 18:55:49 rpmi: libtasn1-4.19.0-alt1 p10+309071.100.2.1 1668522760 installed
[x86_64] <13>Dec  5 18:55:49 rpmi: rpm-macros-alternatives-0.5.2-alt1 p10+309129.100.2.1 1668066636 installed
[x86_64] <13>Dec  5 18:55:49 rpmi: alternatives-0.5.2-alt1 p10+309129.100.2.1 1668066636 installed
[x86_64] <13>Dec  5 18:55:49 rpmi: ca-certificates-2022.09.15-alt1 p10+308004.100.2.1 1665748370 installed
[x86_64] <13>Dec  5 18:55:49 rpmi: ca-trust-0.1.4-alt1 p10+308691.100.3.1 1667496283 installed
[x86_64] <13>Dec  5 18:55:49 rpmi: p11-kit-trust-0.24.1-alt1 p10+305061.100.3.1 1660573397 installed
[x86_64] <13>Dec  5 18:55:49 rpmi: libcrypto1.1-1.1.1q-alt1 p10+303207.100.1.1 1657030549 installed
[x86_64] <13>Dec  5 18:55:49 rpmi: libssl1.1-1.1.1q-alt1 p10+303207.100.1.1 1657030549 installed
[x86_64] <13>Dec  5 18:55:49 rpmi: gem-minitest-5.14.1-alt0.1 sisyphus+249637.100.1.1 1586421683 installed
[x86_64] <13>Dec  5 18:55:49 rpmi: ruby-net-telnet-0.2.0-alt1 sisyphus+219345.2700.8.1 1547631566 installed
[x86_64] <13>Dec  5 18:55:49 rpmi: gem-rake-13.0.1-alt1 sisyphus+248971.320.47.1 1586259947 installed
[x86_64] <13>Dec  5 18:55:49 rpmi: ruby-xmlrpc-0.3.0-alt1 sisyphus+219345.3300.8.1 1547631818 installed
[x86_64] <13>Dec  5 18:55:49 rpmi: gem-2:3.1.6-alt1.1 p10+291491.1000.21.1 1640428300 installed
[x86_64] <13>Dec  5 18:55:49 rpmi: ri-6.1.1-alt3 sisyphus+220149.7500.44.1 1552167568 installed
[x86_64] <13>Dec  5 18:55:49 rpmi: rdoc-6.1.1-alt3 sisyphus+220149.7500.44.1 1552167568 installed
[x86_64] <13>Dec  5 18:55:49 rpmi: ruby-rdoc-6.1.1-alt3 sisyphus+220149.7500.44.1 1552167568 installed
[x86_64] <13>Dec  5 18:55:49 rpmi: rake-13.0.1-alt1 sisyphus+248971.320.47.1 1586259947 installed
[x86_64] <13>Dec  5 18:55:49 rpmi: erb-2.7.4-alt2.2.1 p10+291491.1000.21.1 1640428300 installed
[x86_64] <13>Dec  5 18:55:49 rpmi: irb-2.7.4-alt2.2.1 p10+291491.1000.21.1 1640428300 installed
[x86_64] <13>Dec  5 18:55:49 rpmi: gem-test-unit-3.3.5-alt1 sisyphus+248971.620.47.1 1586260035 installed
[x86_64] <13>Dec  5 18:55:49 rpmi: gem-power-assert-1.1.7-alt1 sisyphus+248971.220.47.1 1586259894 installed
[x86_64] <13>Dec  5 18:55:49 rpmi: bundle-2.1.4-alt1 sisyphus+247301.1100.3.2 1583840910 installed
[x86_64] <13>Dec  5 18:55:50 rpmi: gem-bundler-2.1.4-alt1 sisyphus+247301.1100.3.2 1583840910 installed
[x86_64] <13>Dec  5 18:55:50 rpmi: ruby-2.7.4-alt2.2.1 p10+291491.1000.21.1 1640428300 installed
[x86_64] <13>Dec  5 18:55:50 rpmi: ruby-stdlibs-2.7.4-alt2.2.1 p10+291491.1000.21.1 1640428300 installed
[x86_64] <86>Dec  5 18:55:50 groupadd[1398742]: group added to /etc/group: name=_keytab, GID=499
[x86_64] <86>Dec  5 18:55:50 groupadd[1398742]: group added to /etc/gshadow: name=_keytab
[x86_64] <86>Dec  5 18:55:50 groupadd[1398742]: new group: name=_keytab, GID=499
[x86_64] <13>Dec  5 18:55:50 rpmi: libkrb5-1.19.4-alt1 p10+310093.100.3.1 1669618619 installed
[x86_64] <86>Dec  5 18:55:50 groupadd[1398750]: group added to /etc/group: name=sasl, GID=498
[x86_64] <86>Dec  5 18:55:50 groupadd[1398750]: group added to /etc/gshadow: name=sasl
[x86_64] <86>Dec  5 18:55:50 groupadd[1398750]: new group: name=sasl, GID=498
[x86_64] <13>Dec  5 18:55:50 rpmi: libsasl2-3-2.1.27-alt2.1 sisyphus+278407.100.1.3 1626205817 installed
[x86_64] <13>Dec  5 18:55:50 rpmi: libldap-2.4.59-alt1 p10+282974.100.1.1 1629142498 installed
[x86_64] <13>Dec  5 18:55:50 rpmi: libcurl-7.86.0-alt1 p10+309457.100.2.1 1667965991 installed
[x86_64] <13>Dec  5 18:55:50 rpmi: setup-rb-5.999.6-alt5 p10+311240.40.2.1 1670266535 installed
[x86_64] <13>Dec  5 18:55:50 rpmi: gem-setup-5.999.6-alt5 p10+311240.40.2.1 1670266535 installed
[x86_64] <13>Dec  5 18:55:50 rpmi: libssl-devel-1.1.1q-alt1 p10+303207.100.1.1 1657030549 installed
[x86_64] <13>Dec  5 18:55:50 rpmi: libruby-devel-2.7.4-alt2.2.1 p10+291491.1000.21.1 1640428300 installed
[x86_64] <13>Dec  5 18:55:50 rpmi: openssh-common-7.9p1-alt4.p10.1 p10+297014.100.1.1 1647968390 installed
[x86_64] <86>Dec  5 18:55:50 groupadd[1398764]: group added to /etc/group: name=sshagent, GID=497
[x86_64] <86>Dec  5 18:55:50 groupadd[1398764]: group added to /etc/gshadow: name=sshagent
[x86_64] <86>Dec  5 18:55:50 groupadd[1398764]: new group: name=sshagent, GID=497
[x86_64] <13>Dec  5 18:55:50 rpmi: openssh-clients-7.9p1-alt4.p10.1 p10+297014.100.1.1 1647968390 installed
[x86_64] <13>Dec  5 18:55:51 rpmi: rsync-3.2.5-alt1 p10+305675.100.2.1 1662449478 installed
[x86_64] <13>Dec  5 18:55:51 rpmi: git-core-2.33.5-alt1 p10+308655.100.2.1 1666442337 installed
[x86_64] <13>Dec  5 18:55:51 rpmi: ruby-tool-setup-3.4.1-alt15 sisyphus+224756.300.2.1 1552290808 installed
[x86_64] <13>Dec  5 18:55:51 rpmi: rpm-build-ruby-1:1.0.0-alt13 sisyphus+263592.20.7.1 1608654963 installed
[x86_64] warning: Macro %ruby_alias_names not found
[x86_64] error: line 21: Unknown tag: %ruby_alias_names foreman_puppet,foreman-puppet
[x86_64] hsh-rebuild: pkg.tar: failed to fetch build dependencies.
2022-Dec-05 18:55:51 :: [x86_64] gem-foreman-puppet.git 4.0.3-alt1: remote: cannot build src.rpm
2022-Dec-05 18:55:51 :: [x86_64] #200 gem-foreman-puppet.git 4.0.3-alt1: build FAILED
2022-Dec-05 18:55:51 :: [x86_64] requesting cancellation of task processing
[i586] <13>Dec  5 18:55:48 rpmi: libruby-2.7.4-alt2.2.1 p10+291491.1000.21.1 1640428340 installed
[i586] <13>Dec  5 18:55:48 rpmi: libidn2-2.3.2-alt1 p10+281239.100.3.1 1627673262 installed
[i586] <13>Dec  5 18:55:48 rpmi: libgdbm-1.8.3-alt10 sisyphus+278100.1600.1.1 1626059138 installed
[i586] <13>Dec  5 18:55:48 rpmi: libyaml2-0.2.5-alt1 sisyphus+278391.100.1.1 1626094932 installed
[i586] <13>Dec  5 18:55:48 rpmi: libyaml-devel-0.2.5-alt1 sisyphus+278391.100.1.1 1626094932 installed
[i586] <13>Dec  5 18:55:48 rpmi: libgdbm-devel-1.8.3-alt10 sisyphus+278100.1600.1.1 1626059138 installed
[i586] <13>Dec  5 18:55:48 rpmi: rpm-macros-ruby-1:1.0.0-alt13 sisyphus+263592.20.7.1 1608654963 installed
[i586] <13>Dec  5 18:55:50 rpmi: valgrind-3.17.0-alt2 sisyphus+279814.100.1.1 1626738020 installed
[i586] <13>Dec  5 18:55:50 rpmi: valgrind-devel-3.17.0-alt2 sisyphus+279814.100.1.1 1626738020 installed
[i586] <13>Dec  5 18:55:50 rpmi: zlib-devel-1.2.12-alt3 p10+305356.100.3.1 1661238280 installed
[i586] <13>Dec  5 18:55:50 rpmi: libreadline-devel-7.0.3-alt3 sisyphus+278099.3700.1.1 1626031657 installed
[i586] <13>Dec  5 18:55:50 rpmi: groff-base-1.22.3-alt2 sisyphus+275306.100.2.1 1624538359 installed
[i586] <13>Dec  5 18:55:50 rpmi: libncurses-6.2.20210123-alt1 sisyphus+279621.1300.1.1 1626631090 installed
[i586] <13>Dec  5 18:55:50 rpmi: libtinfo-devel-6.2.20210123-alt1 sisyphus+279621.1300.1.1 1626631090 installed
[i586] <13>Dec  5 18:55:50 rpmi: libncurses-devel-6.2.20210123-alt1 sisyphus+279621.1300.1.1 1626631090 installed
[i586] <13>Dec  5 18:55:50 rpmi: libncursesw-devel-6.2.20210123-alt1 sisyphus+279621.1300.1.1 1626631090 installed
[i586] <13>Dec  5 18:55:50 rpmi: libffi-devel-1:3.3-alt1 sisyphus+278158.300.1.1 1626050399 installed
[i586] <13>Dec  5 18:55:50 rpmi: libdb4.7-devel-4.7.25-alt11 sisyphus+279812.100.2.1 1626734860 installed
[i586] <13>Dec  5 18:55:50 rpmi: libexpat-2.4.3-alt1 p10+293695.100.1.1 1642509080 installed
[i586] <13>Dec  5 18:55:50 rpmi: publicsuffix-list-dafsa-20220703-alt1 p10+303338.100.1.1 1657290596 installed
[i586] <13>Dec  5 18:55:50 rpmi: libpsl-0.21.1-alt2 sisyphus+279461.100.1.1 1626547555 installed
[i586] <13>Dec  5 18:55:50 rpmi: libnghttp2-1.41.0-alt1 sisyphus+275115.100.1.1 1624405485 installed
[i586] <13>Dec  5 18:55:50 rpmi: openldap-common-2.4.59-alt1 p10+282974.100.1.1 1629142498 installed
[i586] <13>Dec  5 18:55:50 rpmi: libbrotlicommon-1.0.9-alt2 sisyphus+278430.100.1.2 1626213212 installed
[i586] <13>Dec  5 18:55:50 rpmi: libbrotlidec-1.0.9-alt2 sisyphus+278430.100.1.2 1626213212 installed
[i586] <13>Dec  5 18:55:50 rpmi: libxxhash-0.8.0-alt2 sisyphus+277476.100.2.1 1625621318 installed
[i586] <13>Dec  5 18:55:50 rpmi: liblz4-1:1.9.3-alt1 sisyphus+278100.4000.1.1 1626060252 installed
[i586] <13>Dec  5 18:55:50 rpmi: libverto-0.3.2-alt1_1 sisyphus+279289.100.1.3 1626493872 installed
[i586] <13>Dec  5 18:55:50 rpmi: liblmdb-0.9.23-alt1 sisyphus+275369.100.1.2 1624493869 installed
[i586] <13>Dec  5 18:55:50 rpmi: libkeyutils-1.6.3-alt1 sisyphus+266061.100.1.1 1612919567 installed
[i586] <13>Dec  5 18:55:50 rpmi: libcom_err-1.46.2.0.16.f114-alt1 sisyphus+278100.1000.1.1 1626056819 installed
[i586] <13>Dec  5 18:55:50 rpmi: libedit3-3.1.20191231-alt1 sisyphus+278505.100.1.1 1626106372 installed
[i586] <13>Dec  5 18:55:51 rpmi: less-530-alt1 sisyphus+278268.100.1.1 1626082714 installed
[i586] <13>Dec  5 18:55:51 rpmi: doxygen-1:1.9.1-alt1 p10+283520.500.2.1 1629893858 installed
[i586] <13>Dec  5 18:55:51 rpmi: diffstat-1.64-alt1 sisyphus+278100.700.1.1 1626056686 installed
[i586] <13>Dec  5 18:55:51 rpmi: chrpath-0.16-alt1 sisyphus+278100.500.1.1 1626056638 installed
[i586] <13>Dec  5 18:55:51 rpmi: libp11-kit-0.24.1-alt1 p10+305061.100.3.1 1660573407 installed
[i586] <13>Dec  5 18:55:51 rpmi: libtasn1-4.19.0-alt1 p10+309071.100.2.1 1668522764 installed
[i586] <13>Dec  5 18:55:51 rpmi: rpm-macros-alternatives-0.5.2-alt1 p10+309129.100.2.1 1668066636 installed
[i586] <13>Dec  5 18:55:51 rpmi: alternatives-0.5.2-alt1 p10+309129.100.2.1 1668066636 installed
[i586] <13>Dec  5 18:55:51 rpmi: ca-certificates-2022.09.15-alt1 p10+308004.100.2.1 1665748370 installed
[i586] <13>Dec  5 18:55:51 rpmi: ca-trust-0.1.4-alt1 p10+308691.100.3.1 1667496283 installed
[i586] <13>Dec  5 18:55:51 rpmi: p11-kit-trust-0.24.1-alt1 p10+305061.100.3.1 1660573407 installed
[i586] <13>Dec  5 18:55:51 rpmi: libcrypto1.1-1.1.1q-alt1 p10+303207.100.1.1 1657030605 installed
[i586] <13>Dec  5 18:55:51 rpmi: libssl1.1-1.1.1q-alt1 p10+303207.100.1.1 1657030605 installed
[i586] <13>Dec  5 18:55:51 rpmi: gem-minitest-5.14.1-alt0.1 sisyphus+249637.100.1.1 1586421683 installed
[i586] <13>Dec  5 18:55:51 rpmi: ruby-net-telnet-0.2.0-alt1 sisyphus+219345.2700.8.1 1547631566 installed
[i586] <13>Dec  5 18:55:51 rpmi: gem-rake-13.0.1-alt1 sisyphus+248971.320.47.1 1586259947 installed
[i586] <13>Dec  5 18:55:51 rpmi: ruby-xmlrpc-0.3.0-alt1 sisyphus+219345.3300.8.1 1547631818 installed
[i586] <13>Dec  5 18:55:51 rpmi: gem-2:3.1.6-alt1.1 p10+291491.1000.21.1 1640428300 installed
[i586] <13>Dec  5 18:55:51 rpmi: ri-6.1.1-alt3 sisyphus+220149.7500.44.1 1552167568 installed
[i586] <13>Dec  5 18:55:51 rpmi: rdoc-6.1.1-alt3 sisyphus+220149.7500.44.1 1552167568 installed
[i586] <13>Dec  5 18:55:51 rpmi: ruby-rdoc-6.1.1-alt3 sisyphus+220149.7500.44.1 1552167568 installed
[i586] <13>Dec  5 18:55:51 rpmi: rake-13.0.1-alt1 sisyphus+248971.320.47.1 1586259947 installed
[i586] <13>Dec  5 18:55:51 rpmi: erb-2.7.4-alt2.2.1 p10+291491.1000.21.1 1640428300 installed
[i586] <13>Dec  5 18:55:51 rpmi: irb-2.7.4-alt2.2.1 p10+291491.1000.21.1 1640428300 installed
[i586] <13>Dec  5 18:55:51 rpmi: gem-test-unit-3.3.5-alt1 sisyphus+248971.620.47.1 1586260035 installed
[i586] <13>Dec  5 18:55:51 rpmi: gem-power-assert-1.1.7-alt1 sisyphus+248971.220.47.1 1586259894 installed
[i586] <13>Dec  5 18:55:51 rpmi: bundle-2.1.4-alt1 sisyphus+247301.1100.3.2 1583840910 installed
[i586] <13>Dec  5 18:55:52 rpmi: gem-bundler-2.1.4-alt1 sisyphus+247301.1100.3.2 1583840910 installed
[i586] <13>Dec  5 18:55:52 rpmi: ruby-2.7.4-alt2.2.1 p10+291491.1000.21.1 1640428340 installed
[i586] <13>Dec  5 18:55:52 rpmi: ruby-stdlibs-2.7.4-alt2.2.1 p10+291491.1000.21.1 1640428340 installed
[i586] <86>Dec  5 18:55:52 groupadd[3501399]: group added to /etc/group: name=_keytab, GID=499
[i586] <86>Dec  5 18:55:52 groupadd[3501399]: group added to /etc/gshadow: name=_keytab
[i586] <86>Dec  5 18:55:52 groupadd[3501399]: new group: name=_keytab, GID=499
[i586] <13>Dec  5 18:55:52 rpmi: libkrb5-1.19.4-alt1 p10+310093.100.3.1 1669618776 installed
[i586] <86>Dec  5 18:55:52 groupadd[3501404]: group added to /etc/group: name=sasl, GID=498
[i586] <86>Dec  5 18:55:52 groupadd[3501404]: group added to /etc/gshadow: name=sasl
[i586] <86>Dec  5 18:55:52 groupadd[3501404]: new group: name=sasl, GID=498
[i586] <13>Dec  5 18:55:52 rpmi: libsasl2-3-2.1.27-alt2.1 sisyphus+278407.100.1.3 1626205820 installed
[i586] <13>Dec  5 18:55:52 rpmi: libldap-2.4.59-alt1 p10+282974.100.1.1 1629142554 installed
[i586] <13>Dec  5 18:55:52 rpmi: libcurl-7.86.0-alt1 p10+309457.100.2.1 1667966008 installed
[i586] <13>Dec  5 18:55:52 rpmi: setup-rb-5.999.6-alt5 p10+311240.40.2.1 1670266537 installed
[i586] <13>Dec  5 18:55:52 rpmi: gem-setup-5.999.6-alt5 p10+311240.40.2.1 1670266537 installed
[i586] <13>Dec  5 18:55:52 rpmi: libssl-devel-1.1.1q-alt1 p10+303207.100.1.1 1657030605 installed
[i586] <13>Dec  5 18:55:52 rpmi: libruby-devel-2.7.4-alt2.2.1 p10+291491.1000.21.1 1640428340 installed
[i586] <13>Dec  5 18:55:52 rpmi: openssh-common-7.9p1-alt4.p10.1 p10+297014.100.1.1 1647968394 installed
[i586] <86>Dec  5 18:55:52 groupadd[3501409]: group added to /etc/group: name=sshagent, GID=497
[i586] <86>Dec  5 18:55:52 groupadd[3501409]: group added to /etc/gshadow: name=sshagent
[i586] <86>Dec  5 18:55:52 groupadd[3501409]: new group: name=sshagent, GID=497
[i586] <13>Dec  5 18:55:52 rpmi: openssh-clients-7.9p1-alt4.p10.1 p10+297014.100.1.1 1647968394 installed
[i586] <13>Dec  5 18:55:52 rpmi: rsync-3.2.5-alt1 p10+305675.100.2.1 1662449479 installed
[i586] <13>Dec  5 18:55:53 rpmi: git-core-2.33.5-alt1 p10+308655.100.2.1 1666442336 installed
[i586] <13>Dec  5 18:55:53 rpmi: ruby-tool-setup-3.4.1-alt15 sisyphus+224756.300.2.1 1552290808 installed
[i586] <13>Dec  5 18:55:53 rpmi: rpm-build-ruby-1:1.0.0-alt13 sisyphus+263592.20.7.1 1608654963 installed
[i586] warning: Macro %ruby_alias_names not found
[i586] error: line 21: Unknown tag: %ruby_alias_names foreman_puppet,foreman-puppet
[i586] hsh-rebuild: pkg.tar: failed to fetch build dependencies.
2022-Dec-05 18:55:54 :: [i586] gem-foreman-puppet.git 4.0.3-alt1: remote: cannot build src.rpm
2022-Dec-05 18:55:54 :: [i586] #200 gem-foreman-puppet.git 4.0.3-alt1: build FAILED
2022-Dec-05 18:56:02 :: [aarch64] #40 gem-setup.git 5.999.6-alt5: build OK
2022-Dec-05 18:56:02 :: [aarch64] task processing CANCELLED
2022-Dec-05 18:56:18 :: [ppc64le] #40 gem-setup.git 5.999.6-alt5: build OK
2022-Dec-05 18:56:18 :: [ppc64le] task processing CANCELLED
2022-Dec-05 18:56:29 :: [armh] #40 gem-setup.git 5.999.6-alt5: build OK
2022-Dec-05 18:56:29 :: [armh] task processing CANCELLED
2022-Dec-05 18:55:52 :: [x86_64] build FAILED
2022-Dec-05 18:55:54 :: [i586] build FAILED
2022-Dec-05 18:56:02 :: [aarch64] build FAILED
2022-Dec-05 18:56:18 :: [ppc64le] build FAILED
2022-Dec-05 18:56:29 :: [armh] build FAILED
2022-Dec-05 18:56:29 :: task #311240 for p10 FAILED


More information about the Girar-builder-p10 mailing list