[devel] Stop html (was Re: [cyber] I: Sisyphus-20210902 x86_64 beehive_status: +154) -27 (558)

Alexey Gladkov legion ÎÁ altlinux.ru
ţÔ óĹÎ 2 13:46:48 MSK 2021


On Thu, Sep 02, 2021 at 01:32:08PM +0300, óËŇŮĚĹ×ß íÁĚß wrote:
>    š
>    š
>    02.09.2021, 13:06, "Dmitry V. Levin" <ldv ÎÁ altlinux.org>:
> 
>      JFYI
> 
>      ----- Forwarded message from ALT beekeeper <[1]hiver ÎÁ altlinux> -----
> 
>      Date: Thu, 2 Sep 2021 07:01:06 +0000
>      From: ALT beekeeper <[2]hiver ÎÁ altlinux>
>      To: [3]sisyphus-cybertalk ÎÁ lists.altlinux
>      Subject: [cyber] I: Sisyphus-20210902 x86_64 beehive_status: +154 -27 (558)
> 
>      šššššššš154 NEW error logs
> 
>      fusioninventory-agent-2.6-alt1
>      ššššššššCan't locate UNIVERSAL/require.pm in @INC (you may need to install the
>      ššššššššUNIVERSAL::require module) (@[4]INC contains: /usr/share/fusioninventory/lib /usr/lib/rpm
>      šššššššš/usr/src/tmp/fusioninventory-agent-buildroot/usr/share/fusioninventory/lib
>      šššššššš/usr/lib64/perl5 /usr/share/perl5 /etc/perl5 /usr/lib/perl5/vendor_perl
>      šššššššš/usr/local/lib64/perl/5.34 /usr/local/share/perl/5.34 .) at
>      šššššššš/usr/src/tmp/fusioninventory-agent-buildroot/usr/bin/fusioninventory-esx line 12.
>      ššššššššBEGIN failed--compilation aborted at
>      šššššššš/usr/src/tmp/fusioninventory-agent-buildroot/usr/bin/fusioninventory-esx line 12.
>      šššššššš# perl(UNIVERSAL/require.pm) at line 12 (depth 3) not loaded at BEGIN SKIP
>      šššššššš# /usr/src/tmp/fusioninventory-agent-buildroot/usr/bin/fusioninventory-esx: deparse
>      ššššššššfailed. isPerl=0.0313473520249221.
>      ššššššššfind-requires: ERROR: /usr/lib/rpm/perl.req failed
>      ššššššššerror: /bin/sh failed
>      ššššššššerror: Failed to find Requires
>      ššššššššRPM build errors:
> 
>      gem-airbrussh-1.3.1-alt1
>      šššššššš+ /bin/mkdir -p /usr/src/RPM/BUILD
>      šššššššš+ cd /usr/src/RPM/BUILD
>      šššššššš+ cd gem-airbrussh-1.3.1
>      šššššššš+ %gem_build
>      šššššššš/usr/src/tmp/rpm-tmp.77069: line 139: fg: no job control
>      ššššššššerror: Bad exit status from /usr/src/tmp/rpm-tmp.77069 (%build)
>      ššššššššRPM build errors:
>      ššššššššMacro %gem_build not found
>      ššššššššMacro %gem_install not found
>      ššššššššMacro %gem_test not found
> 
>      gem-ansi-1.5.0-alt1
>      ššššššššwarning: Macro %vcs not found
>      ššššššššerror: line 10: Unknown tag: %vcs [5]https://github.com/rubyworks/ansi.git
>      ššššššššhsh-rebuild: gem-ansi-1.5.0-alt1.src.rpm: failed to fetch build dependencies.
> 
>      gem-autoprefixer-rails-9.6.0-alt1
>      ššššššššwarning: Macro %vcs not found
>      ššššššššerror: line 10: Unknown tag: %vcs [6]https://github.com/ai/autoprefixer-rails.git
>      ššššššššhsh-rebuild: gem-autoprefixer-rails-9.6.0-alt1.src.rpm: failed to fetch build dependencies.
> 
>      gem-binman-5.1.0-alt1
>      šššššššš+ /bin/mkdir -p /usr/src/RPM/BUILD
>      šššššššš+ cd /usr/src/RPM/BUILD
>      šššššššš+ cd gem-binman-5.1.0
>      šššššššš+ %gem_build
>      šššššššš/usr/src/tmp/rpm-tmp.23065: line 139: fg: no job control
>      ššššššššerror: Bad exit status from /usr/src/tmp/rpm-tmp.23065 (%build)
>      ššššššššRPM build errors:
>      ššššššššMacro %gem_build not found
>      ššššššššMacro %gem_install not found
>      ššššššššMacro %gem_test not found
> 
>      gem-bootstrap-sass-3.4.1-alt1
>      ššššššššwarning: Macro %vcs not found
>      ššššššššerror: line 10: Unknown tag: %vcs [7]https://github.com/twbs/bootstrap-sass.git
>      ššššššššhsh-rebuild: gem-bootstrap-sass-3.4.1-alt1.src.rpm: failed to fetch build dependencies.
> 
>      gem-clamp-1.3.0-alt1
>      ššššššššwarning: Macro %vcs not found
>      ššššššššerror: line 10: Unknown tag: %vcs [8]https://github.com/mdub/clamp.git
>      ššššššššhsh-rebuild: gem-clamp-1.3.0-alt1.src.rpm: failed to fetch build dependencies.
> 
>      gem-coffee-script-source-2.1.1-alt2
>      ššššššššwarning: Macro %vcs not found
>      ššššššššerror: line 11: Unknown tag: %vcs
>      šššššššš[9]https://github.com/joeldrapper/coffee-script-source.git
>      ššššššššhsh-rebuild: gem-coffee-script-source-2.1.1-alt2.src.rpm: failed to fetch build
>      ššššššššdependencies.
> 
>      gem-colorator-1.1.0-alt1
>      ššššššššwarning: Macro %ruby_test_unit not found
>      ššššššššerror: Macro %rubygem_specdir not found
>      ššššššššerror: line 49: %rubygem_specdir/*
>      ššššššššInstalling gem-colorator-1.1.0-alt1.src.rpm
> 
>      gem-commonjs-0.2.7-alt1
>      ššššššššwarning: Macro %vcs not found
>      ššššššššerror: line 10: Unknown tag: %vcs [10]http://github.com/cowboyd/commonjs.rb
>      ššššššššhsh-rebuild: gem-commonjs-0.2.7-alt1.src.rpm: failed to fetch build dependencies.
> 
>      gem-crack-0.4.3-alt1
>      ššššššššwarning: Macro %vcs not found
>      ššššššššerror: line 10: Unknown tag: %vcs [11]https://github.com/jnunemaker/crack.git
>      ššššššššhsh-rebuild: gem-crack-0.4.3-alt1.src.rpm: failed to fetch build dependencies.
> 
>      gem-creole-0.5.0-alt1
>      ššššššššwarning: Macro %vcs not found
>      ššššššššerror: line 10: Unknown tag: %vcs [12]https://github.com/minad/creole.git
>      ššššššššhsh-rebuild: gem-creole-0.5.0-alt1.src.rpm: failed to fetch build dependencies.
> 
>      gem-docker-api-1.34.2-alt1.1
>      ššššššššwarning: Macro %vcs not found
>      ššššššššerror: line 11: Unknown tag: %vcs [13]https://github.com/swipely/docker-api.git
>      ššššššššhsh-rebuild: gem-docker-api-1.34.2-alt1.1.src.rpm: failed to fetch build dependencies.
> 
>      gem-dry-inflector-0.1.2-alt1
>      ššššššššwarning: Macro %vcs not found
>      ššššššššerror: line 10: Unknown tag: %vcs [14]https://github.com/dry-rb/dry-inflector.git
>      ššššššššhsh-rebuild: gem-dry-inflector-0.1.2-alt1.src.rpm: failed to fetch build dependencies.
> 
>      gem-em-websocket-0.5.2-alt1
>      ššššššššwarning: Macro %ruby_test_unit not found
>      ššššššššerror: Macro %rubygem_specdir not found
>      ššššššššerror: line 51: %rubygem_specdir/*
>      ššššššššInstalling gem-em-websocket-0.5.2-alt1.src.rpm
> 
>      gem-equatable-0.6.1-alt1.1
>      ššššššššwarning: Macro %vcs not found
>      ššššššššerror: line 11: Unknown tag: %vcs [15]https://github.com/piotrmurach/equatable.git
>      ššššššššhsh-rebuild: gem-equatable-0.6.1-alt1.1.src.rpm: failed to fetch build dependencies.
> 
>      gem-expression-parser-0.9.1-alt1
>      ššššššššwarning: Macro %vcs not found
>      ššššššššerror: line 11: Unknown tag: %vcs
>      šššššššš[16]https://github.com/nricciar/expression_parser.git
>      ššššššššhsh-rebuild: gem-expression-parser-0.9.1-alt1.src.rpm: failed to fetch build dependencies.
> 
>      gem-faraday-cookie-jar-0.0.6-alt1.1
>      ššššššššwarning: Macro %vcs not found
>      ššššššššerror: line 12: Unknown tag: %vcs
>      šššššššš[17]https://github.com/miyagawa/faraday-cookie_jar.git
>      ššššššššhsh-rebuild: gem-faraday-cookie-jar-0.0.6-alt1.1.src.rpm: failed to fetch build
>      ššššššššdependencies.
> 
>      gem-ffi-1.15.0-alt1
>      ššššššššProcessing files: gem-ffi-1.15.0-alt1
>      ššššššššerror: No such file or directory:
>      šššššššš/usr/src/tmp/gem-ffi-buildroot/usr/lib/ruby/gems/2.7.0/specifications/ffi-1.15.0.gemspec
>      ššššššššerror: No such file or directory:
>      šššššššš/usr/src/tmp/gem-ffi-buildroot/usr/lib/ruby/gems/2.7.0/gems/ffi-1.15.0
>      ššššššššerror: No such file or directory:
>      šššššššš/usr/src/tmp/gem-ffi-buildroot/usr/lib/ruby/gems/2.7.0/extensions/x86_64-linux/2.7.0/ffi-1.15.0
>      ššššššššExecuting(%doc): /bin/sh -e /usr/src/tmp/rpm-tmp.60924
>      šššššššš--
>      ššššššššMacro %pkgname not found
>      ššššššššNo such file or directory:
>      šššššššš/usr/src/tmp/gem-ffi-buildroot/usr/lib/ruby/gems/2.7.0/specifications/ffi-1.15.0.gemspec
>      ššššššššNo such file or directory:
>      šššššššš/usr/src/tmp/gem-ffi-buildroot/usr/lib/ruby/gems/2.7.0/gems/ffi-1.15.0
>      ššššššššNo such file or directory:
>      šššššššš/usr/src/tmp/gem-ffi-buildroot/usr/lib/ruby/gems/2.7.0/extensions/x86_64-linux/2.7.0/ffi-1.15.0
> 
>      gem-fog-cloudstack-0.1.0-alt1
>      ššššššššwarning: Macro %vcs not found
>      ššššššššerror: line 10: Unknown tag: %vcs [18]https://github.com/fog/fog-cloudstack.git
>      ššššššššhsh-rebuild: gem-fog-cloudstack-0.1.0-alt1.src.rpm: failed to fetch build dependencies.
> 
>      gem-font-awesome-sass-5.11.2-alt1
>      ššššššššwarning: Macro %vcs not found
>      ššššššššerror: line 11: Unknown tag: %vcs
>      šššššššš[19]https://github.com/FortAwesome/font-awesome-sass.git
>      ššššššššhsh-rebuild: gem-font-awesome-sass-5.11.2-alt1.src.rpm: failed to fetch build dependencies.
> 
>      gem-forwardable-extended-2.6.0-alt1
>      ššššššššwarning: Macro %ruby_test_unit not found
>      ššššššššerror: Macro %rubygem_specdir not found
>      ššššššššerror: line 51: %rubygem_specdir/*
>      ššššššššInstalling gem-forwardable-extended-2.6.0-alt1.src.rpm
> 
>      gem-gettext-i18n-rails-js-1.3.0-alt1
>      ššššššššwarning: Macro %vcs not found
>      ššššššššerror: line 11: Unknown tag: %vcs
>      šššššššš[20]https://github.com/webhippie/gettext_i18n_rails_js.git
>      ššššššššhsh-rebuild: gem-gettext-i18n-rails-js-1.3.0-alt1.src.rpm: failed to fetch build
>      ššššššššdependencies.
> 
>      gem-gettext-setup-1.0.1-alt1.1
>      šššššššš[!] There was an error parsing `Gemfile`:
>      šššššššš[!] There was an error while loading `gettext-setup.gemspec`: No such file or directory -
>      ššššššššgit. Bundler cannot continue.
>      šššššššš# from /usr/src/RPM/BUILD/gem-gettext-setup-1.0.1/gettext-setup.gemspec:8
>      šššššššš--
>      šššššššš[!] There was an error parsing `Gemfile`:
>      šššššššš[!] There was an error while loading `gettext-setup.gemspec`: No such file or directory -
>      ššššššššgit. Bundler cannot continue.
>      šššššššš# from /usr/src/RPM/BUILD/gem-gettext-setup-1.0.1/gettext-setup.gemspec:8
>      šššššššš--
>      šššššššš> gemspec
>      ššššššššInvalid gemspec in [gettext-setup.gemspec]: No such file or directory - git
>      ššššššššWARN [Errno::ENOENT]: No such file or directory - git
>      šššššššš[ gemfile 'gem-gettext-setup' at /usr/src/RPM/BUILD/gem-gettext-setup-1.0.1 ]
>      šššššššš--
>      šššššššš+ /usr/lib/rpm/brp-alt
>      šššššššš/usr/lib/rpm/brp-alt: line 26: cd: /usr/src/tmp/gem-gettext-setup-buildroot: No such
>      ššššššššfile or directory
> 
>      gem-graphql-1.9.6-alt1
>      šššššššš+ /bin/mkdir -p /usr/src/RPM/BUILD
>      šššššššš+ cd /usr/src/RPM/BUILD
>      šššššššš+ cd gem-graphql-1.9.6
>      šššššššš+ %gem_build
>      šššššššš/usr/src/tmp/rpm-tmp.2778: line 139: fg: no job control
>      ššššššššerror: Bad exit status from /usr/src/tmp/rpm-tmp.2778 (%build)
>      ššššššššRPM build errors:
>      ššššššššMacro %gem_build not found
>      ššššššššMacro %gem_install not found
>      ššššššššMacro %gem_test not found
> 
>      gem-graphql-batch-0.4.1-alt1
>      ššššššššwarning: Macro %vcs not found
>      ššššššššerror: line 11: Unknown tag: %vcs [21]https://github.com/Shopify/graphql-batch.git
>      ššššššššhsh-rebuild: gem-graphql-batch-0.4.1-alt1.src.rpm: failed to fetch build dependencies.
> 
>      gem-gssapi-1.2.0-alt1
>      šššššššš+ /bin/mkdir -p /usr/src/RPM/BUILD
>      šššššššš+ cd /usr/src/RPM/BUILD
>      šššššššš+ cd gem-gssapi-1.2.0
>      šššššššš+ %gem_build
>      šššššššš/usr/src/tmp/rpm-tmp.12333: line 139: fg: no job control
>      ššššššššerror: Bad exit status from /usr/src/tmp/rpm-tmp.12333 (%build)
>      ššššššššRPM build errors:
>      ššššššššMacro %gem_build not found
>      ššššššššMacro %gem_install not found
>      ššššššššMacro %gem_test not found
> 
>      gem-hashdiff-0.4.0-alt1
>      ššššššššwarning: Macro %vcs not found
>      ššššššššerror: line 10: Unknown tag: %vcs [22]https://github.com/liufengyun/hashdiff.git
>      ššššššššhsh-rebuild: gem-hashdiff-0.4.0-alt1.src.rpm: failed to fetch build dependencies.
> 
>      gem-htmlentities-4.3.3-alt1
>      šššššššš+ /bin/mkdir -p /usr/src/RPM/BUILD
>      šššššššš+ cd /usr/src/RPM/BUILD
>      šššššššš+ cd gem-htmlentities-4.3.3
>      šššššššš+ %gem_build
>      šššššššš/usr/src/tmp/rpm-tmp.57286: line 139: fg: no job control
>      ššššššššerror: Bad exit status from /usr/src/tmp/rpm-tmp.57286 (%build)
>      ššššššššRPM build errors:
>      ššššššššMacro %gem_build not found
>      ššššššššMacro %gem_install not found
>      ššššššššMacro %gem_test not found
> 
>      gem-http-accept-1.7.0-alt1
>      ššššššššwarning: Macro %vcs not found
>      ššššššššerror: line 11: Unknown tag: %vcs [23]https://github.com/socketry/http-accept.git
>      ššššššššhsh-rebuild: gem-http-accept-1.7.0-alt1.src.rpm: failed to fetch build dependencies.
> 
>      gem-image-size-2.0.0-alt1
>      šššššššš+ /bin/mkdir -p /usr/src/RPM/BUILD
>      šššššššš+ cd /usr/src/RPM/BUILD
>      šššššššš+ cd gem-image-size-2.0.0
>      šššššššš+ %gem_build
>      šššššššš/usr/src/tmp/rpm-tmp.37185: line 139: fg: no job control
>      ššššššššerror: Bad exit status from /usr/src/tmp/rpm-tmp.37185 (%build)
>      ššššššššRPM build errors:
>      ššššššššMacro %gem_build not found
>      ššššššššMacro %gem_install not found
>      ššššššššMacro %gem_test not found
> 
>      gem-inifile-3.0.0-alt1
>      šššššššš+ /bin/mkdir -p /usr/src/RPM/BUILD
>      šššššššš+ cd /usr/src/RPM/BUILD
>      šššššššš+ cd gem-inifile-3.0.0
>      šššššššš+ %gem_build
>      šššššššš/usr/src/tmp/rpm-tmp.64313: line 139: fg: no job control
>      ššššššššerror: Bad exit status from /usr/src/tmp/rpm-tmp.64313 (%build)
>      ššššššššRPM build errors:
>      ššššššššMacro %gem_build not found
>      ššššššššMacro %gem_install not found
>      ššššššššMacro %gem_test not found
> 
>      gem-jekyll-4.2.0-alt1
>      ššššššššwarning: Macro %ruby_test_unit not found
>      ššššššššerror: Macro %rubygem_specdir not found
>      ššššššššerror: line 65: %rubygem_specdir/*
>      ššššššššInstalling gem-jekyll-4.2.0-alt1.src.rpm
> 
>      gem-jekyll-sass-converter-2.1.0-alt1
>      ššššššššwarning: Macro %ruby_test_unit not found
>      ššššššššerror: Macro %rubygem_specdir not found
>      ššššššššerror: line 51: %rubygem_specdir/*
>      ššššššššInstalling gem-jekyll-sass-converter-2.1.0-alt1.src.rpm
> 
>      gem-jekyll-watch-2.2.1-alt1
>      ššššššššwarning: Macro %ruby_test_unit not found
>      ššššššššerror: Macro %rubygem_specdir not found
>      ššššššššerror: line 50: %rubygem_specdir/*
>      ššššššššInstalling gem-jekyll-watch-2.2.1-alt1.src.rpm
> 
>      gem-journald-logger-2.0.4-alt1.1
>      ššššššššwarning: Macro %vcs not found
>      ššššššššerror: line 11: Unknown tag: %vcs
>      šššššššš[24]https://github.com/sandfoxme/journald-logger.git
>      ššššššššhsh-rebuild: gem-journald-logger-2.0.4-alt1.1.src.rpm: failed to fetch build dependencies.
> 
>      gem-jquery-ui-rails-6.0.1-alt1
>      ššššššššwarning: Macro %vcs not found
>      ššššššššerror: line 10: Unknown tag: %vcs
>      šššššššš[25]https://github.com/jquery-ui-rails/jquery-ui-rails.git
>      ššššššššhsh-rebuild: gem-jquery-ui-rails-6.0.1-alt1.src.rpm: failed to fetch build dependencies.
> 
>      gem-kafo-3.0.0-alt1.1
>      ššššššššwarning: Macro %vcs not found
>      ššššššššerror: line 10: Unknown tag: %vcs [26]https://github.com/theforeman/kafo.git
>      ššššššššhsh-rebuild: gem-kafo-3.0.0-alt1.1.src.rpm: failed to fetch build dependencies.
> 
>      gem-kafo-parsers-1.0.0-alt1
>      ššššššššwarning: Macro %vcs not found
>      ššššššššerror: line 11: Unknown tag: %vcs [27]https://github.com/theforeman/kafo_parsers.git
>      ššššššššhsh-rebuild: gem-kafo-parsers-1.0.0-alt1.src.rpm: failed to fetch build dependencies.
> 
>      gem-kafo-wizards-0.0.1-alt1
>      ššššššššwarning: Macro %vcs not found
>      ššššššššerror: line 11: Unknown tag: %vcs [28]https://github.com/theforeman/kafo_wizards.git
>      ššššššššhsh-rebuild: gem-kafo-wizards-0.0.1-alt1.src.rpm: failed to fetch build dependencies.
> 
>      gem-kramdown-2.3.1-alt1
>      ššššššššwarning: Macro %vcs not found
>      ššššššššerror: line 12: Unknown tag: %vcs [29]https://github.com/gettalong/kramdown.git
>      ššššššššhsh-rebuild: gem-kramdown-2.3.1-alt1.src.rpm: failed to fetch build dependencies.
> 
>      gem-kramdown-parser-gfm-1.0.1-alt1
>      ššššššššwarning: Macro %ruby_test_unit not found
>      ššššššššerror: Macro %rubygem_specdir not found
>      ššššššššerror: line 50: %rubygem_specdir/*
>      ššššššššInstalling gem-kramdown-parser-gfm-1.0.1-alt1.src.rpm
> 
>      gem-libyajl2-1.2.0-alt1
>      šššššššš+ /bin/mkdir -p /usr/src/RPM/BUILD
>      šššššššš+ cd /usr/src/RPM/BUILD
>      šššššššš+ cd libyajl2-1.2.0
>      šššššššš+ %gem_build
>      šššššššš/usr/src/tmp/rpm-tmp.45062: line 139: fg: no job control
>      ššššššššerror: Bad exit status from /usr/src/tmp/rpm-tmp.45062 (%build)
>      ššššššššRPM build errors:
>      ššššššššMacro %gem_build not found
>      ššššššššMacro %gem_install not found
>      ššššššššMacro %gem_test not found
> 
>      gem-liquid-4.0.3-alt1
>      ššššššššwarning: Macro %vcs not found
>      ššššššššerror: line 10: Unknown tag: %vcs [30]https://shopify.github.io/liquid/
>      ššššššššhsh-rebuild: gem-liquid-4.0.3-alt1.src.rpm: failed to fetch build dependencies.
> 
>      gem-logging-journald-2.0.3-alt1.1
>      ššššššššwarning: Macro %vcs not found
>      ššššššššerror: line 11: Unknown tag: %vcs [31]https://github.com/lzap/logging-journald.git
>      ššššššššhsh-rebuild: gem-logging-journald-2.0.3-alt1.1.src.rpm: failed to fetch build dependencies.
> 
>      gem-loofah-2.4.0-alt1
>      ššššššššWrote: /usr/src/in/nosrpm/gem-loofah-2.4.0-alt1.nosrc.rpm (w1.gzdio)
>      ššššššššerror: Macro %rubygem_specdir not found
>      ššššššššerror: line 53: %rubygem_specdir/*
>      ššššššššInstalling gem-loofah-2.4.0-alt1.src.rpm
> 
>      gem-m-1.5.1-alt1
>      ššššššššwarning: Macro %vcs not found
>      ššššššššerror: line 11: Unknown tag: %vcs [32]https://github.com/qrush/m.git
>      ššššššššhsh-rebuild: gem-m-1.5.1-alt1.src.rpm: failed to fetch build dependencies.
> 
>      gem-markaby-0.9.0-alt1
>      ššššššššwarning: Macro %vcs not found
>      ššššššššerror: line 10: Unknown tag: %vcs [33]https://github.com/markaby/markaby.git
>      ššššššššhsh-rebuild: gem-markaby-0.9.0-alt1.src.rpm: failed to fetch build dependencies.
> 
>      gem-md2man-5.1.2-alt1
>      šššššššš+ /bin/mkdir -p /usr/src/RPM/BUILD
>      šššššššš+ cd /usr/src/RPM/BUILD
>      šššššššš+ cd gem-md2man-5.1.2
>      šššššššš+ %gem_build
>      šššššššš/usr/src/tmp/rpm-tmp.71588: line 139: fg: no job control
>      ššššššššerror: Bad exit status from /usr/src/tmp/rpm-tmp.71588 (%build)
>      ššššššššRPM build errors:
>      ššššššššMacro %gem_build not found
>      ššššššššMacro %gem_install not found
>      ššššššššMacro %gem_test not found
> 
>      gem-mercenary-0.4.0-alt1
>      ššššššššwarning: Macro %ruby_test_unit not found
>      ššššššššerror: Macro %rubygem_specdir not found
>      ššššššššerror: line 51: %rubygem_specdir/*
>      ššššššššInstalling gem-mercenary-0.4.0-alt1.src.rpm
> 
>      gem-minitest-proveit-1.0.0-alt1
>      ššššššššwarning: Macro %vcs not found
>      ššššššššerror: line 11: Unknown tag: %vcs
>      šššššššš[34]https://github.com/seattlerb/minitest-proveit.git
>      ššššššššhsh-rebuild: gem-minitest-proveit-1.0.0-alt1.src.rpm: failed to fetch build dependencies.
> 
>      gem-minitest-retry-0.1.9-alt1
>      ššššššššwarning: Macro %vcs not found
>      ššššššššerror: line 11: Unknown tag: %vcs [35]https://github.com/y-yagi/minitest-retry.git
>      ššššššššhsh-rebuild: gem-minitest-retry-0.1.9-alt1.src.rpm: failed to fetch build dependencies.
> 
>      gem-necromancer-0.5.0-alt1.1
>      ššššššššwarning: Macro %vcs not found
>      ššššššššerror: line 11: Unknown tag: %vcs [36]https://github.com/piotrmurach/necromancer.git
>      ššššššššhsh-rebuild: gem-necromancer-0.5.0-alt1.1.src.rpm: failed to fetch build dependencies.
> 
>      gem-net-http-digest-auth-1.4.1-alt1
>      ššššššššwarning: Macro %vcs not found
>      ššššššššerror: line 12: Unknown tag: %vcs
>      šššššššš[37]https://github.com/drbrain/net-http-digest_auth.git
>      ššššššššhsh-rebuild: gem-net-http-digest-auth-1.4.1-alt1.src.rpm: failed to fetch build
>      ššššššššdependencies.
> 
>      gem-netrc-0.11.0-alt1.1
>      šššššššš+ /usr/bin/ruby -rvendor-specific /usr/bin/setup.rb build --shebang=auto
>      šššššššš--prefixes=gem,ruby,rails-engine --gem-version-replace= --ignore-names= --regard-names=
>      šššššššš--alias=netrc:netrc --alias=:: --use-gem-dependencies= --pre= --use-gem-version=
>      ššššššššInvalid gemspec in [netrc.gemspec]: No such file or directory - git
>      ššššššššWARN [Errno::ENOENT]: No such file or directory - git
>      šššššššš[ gemfile 'gem-netrc' at /usr/src/RPM/BUILD/gem-netrc-0.11.0 ]
>      šššššššš--
>      šššššššš+ /usr/lib/rpm/brp-alt
>      šššššššš/usr/lib/rpm/brp-alt: line 26: cd: /usr/src/tmp/gem-netrc-buildroot: No such file
>      ššššššššor directory
> 
>      gem-ntlm-http-0.1.3.3-alt1
>      ššššššššwarning: Macro %vcs not found
>      ššššššššerror: line 11: Unknown tag: %vcs [38]https://github.com/pyu10055/ntlm-http.git
>      ššššššššhsh-rebuild: gem-ntlm-http-0.1.3.3-alt1.src.rpm: failed to fetch build dependencies.
> 
>      gem-octokit-4.14.0-alt1.1
>      ššššššššwarning: Macro %vcs not found
>      ššššššššerror: line 11: Unknown tag: %vcs [39]https://github.com/octokit/octokit.rb.git
>      ššššššššhsh-rebuild: gem-octokit-4.14.0-alt1.1.src.rpm: failed to fetch build dependencies.
> 
>      gem-opener-0.1.0-alt1
>      šššššššš+ /bin/mkdir -p /usr/src/RPM/BUILD
>      šššššššš+ cd /usr/src/RPM/BUILD
>      šššššššš+ cd gem-opener-0.1.0
>      šššššššš+ %gem_build
>      šššššššš/usr/src/tmp/rpm-tmp.5121: line 139: fg: no job control
>      ššššššššerror: Bad exit status from /usr/src/tmp/rpm-tmp.5121 (%build)
>      ššššššššRPM build errors:
>      ššššššššMacro %gem_build not found
>      ššššššššMacro %gem_install not found
>      ššššššššMacro %gem_test not found
> 
>      gem-optimist-3.0.0-alt1
>      ššššššššwarning: Macro %vcs not found
>      ššššššššerror: line 10: Unknown tag: %vcs [40]https://github.com/ManageIQ/optimist.git
>      ššššššššhsh-rebuild: gem-optimist-3.0.0-alt1.src.rpm: failed to fetch build dependencies.
> 
>      gem-packaging-0.99.59-alt1
>      šššššššš+ /usr/bin/ruby -rvendor-specific /usr/bin/setup.rb build --shebang=auto
>      šššššššš--prefixes=gem,ruby,rails-engine '--gem-version-replace=:artifactory ~>
>      šššššššš3.0' --ignore-names= --regard-names= --alias=packaging:packaging --alias=::
>      šššššššš--use-gem-dependencies= --pre= --use-gem-version= --ignore=acceptance --use=packaging
>      šššššššš--version-replace=0.99.59
>      ššššššššInvalid gemspec in [packaging.gemspec]: No such file or directory - git
>      ššššššššWARN [Errno::ENOENT]: No such file or directory - git
>      šššššššš[ gemfile 'acceptance' at /usr/src/RPM/BUILD/gem-packaging-0.99.59/acceptance ]
>      šššššššš--
>      šššššššš+ /usr/lib/rpm/brp-alt
>      šššššššš/usr/lib/rpm/brp-alt: line 26: cd: /usr/src/tmp/gem-packaging-buildroot: No such file
>      ššššššššor directory
> 
>      gem-parallel-1.20.1-alt1
>      šššššššš+ /bin/mkdir -p /usr/src/RPM/BUILD
>      šššššššš+ cd /usr/src/RPM/BUILD
>      šššššššš+ cd gem-parallel-1.20.1
>      šššššššš+ %gem_build
>      šššššššš/usr/src/tmp/rpm-tmp.42231: line 139: fg: no job control
>      ššššššššerror: Bad exit status from /usr/src/tmp/rpm-tmp.42231 (%build)
>      ššššššššRPM build errors:
>      ššššššššMacro %gem_build not found
>      ššššššššMacro %gem_install not found
>      ššššššššMacro %gem_test not found
> 
>      gem-pathutil-0.16.2-alt1
>      ššššššššwarning: Macro %ruby_test_unit not found
>      ššššššššerror: Macro %rubygem_specdir not found
>      ššššššššerror: line 51: %rubygem_specdir/*
>      ššššššššInstalling gem-pathutil-0.16.2-alt1.src.rpm
> 
>      gem-po-to-json-1.0.1-alt1
>      ššššššššwarning: Macro %vcs not found
>      ššššššššerror: line 11: Unknown tag: %vcs [41]https://github.com/webhippie/po_to_json.git
>      ššššššššhsh-rebuild: gem-po-to-json-1.0.1-alt1.src.rpm: failed to fetch build dependencies.
> 
>      gem-powerbar-2.0.1-alt1
>      ššššššššwarning: Macro %vcs not found
>      ššššššššerror: line 10: Unknown tag: %vcs [42]https://github.com/busyloop/powerbar.git
>      ššššššššhsh-rebuild: gem-powerbar-2.0.1-alt1.src.rpm: failed to fetch build dependencies.
> 
>      gem-powerpack-0.1.2-alt1
>      šššššššš+ /bin/mkdir -p /usr/src/RPM/BUILD
>      šššššššš+ cd /usr/src/RPM/BUILD
>      šššššššš+ cd gem-powerpack-0.1.2
>      šššššššš+ %gem_build
>      šššššššš/usr/src/tmp/rpm-tmp.65411: line 139: fg: no job control
>      ššššššššerror: Bad exit status from /usr/src/tmp/rpm-tmp.65411 (%build)
>      ššššššššRPM build errors:
>      ššššššššMacro %gem_build not found
>      ššššššššMacro %gem_install not found
>      ššššššššMacro %gem_test not found
> 
>      gem-prometheus-client-2.0.0-alt1
>      ššššššššwarning: Macro %vcs not found
>      ššššššššerror: line 10: Unknown tag: %vcs [43]https://github.com/prometheus/client_ruby.git
>      ššššššššhsh-rebuild: gem-prometheus-client-2.0.0-alt1.src.rpm: failed to fetch build dependencies.
> 
>      gem-promise-rb-0.7.4-alt1
>      šššššššš+ cd /usr/src/RPM/BUILD
>      šššššššš+ cd gem-promise-rb-0.7.4
>      šššššššš+ %gem_build
>      šššššššš/usr/src/tmp/rpm-tmp.87921: line 139: fg: no job control
>      ššššššššerror: Bad exit status from /usr/src/tmp/rpm-tmp.87921 (%build)
>      ššššššššRPM build errors:
>      ššššššššUnparseable macro: % mutation coverage, tested on
>      ššššššššMacro %gem_build not found
>      ššššššššMacro %gem_install not found
>      ššššššššMacro %gem_test not found
> 
>      gem-puppet-strings-2.2.0-alt1
>      ššššššššwarning: Macro %vcs not found
>      ššššššššerror: line 10: Unknown tag: %vcs
>      šššššššš[44]https://github.com/puppetlabs/puppet-strings.git
>      ššššššššhsh-rebuild: gem-puppet-strings-2.2.0-alt1.src.rpm: failed to fetch build dependencies.
> 
>      gem-quantile-0.2.1-alt1
>      ššššššššwarning: Macro %vcs not found
>      ššššššššerror: line 10: Unknown tag: %vcs
>      šššššššš[45]https://github.com/matttproud/ruby_quantile_estimation.git
>      ššššššššhsh-rebuild: gem-quantile-0.2.1-alt1.src.rpm: failed to fetch build dependencies.
> 
>      gem-rack-cors-1.0.3-alt1.1
>      ššššššššwarning: Macro %vcs not found
>      ššššššššerror: line 11: Unknown tag: %vcs [46]https://github.com/cyu/rack-cors.git
>      ššššššššhsh-rebuild: gem-rack-cors-1.0.3-alt1.1.src.rpm: failed to fetch build dependencies.
> 
>      gem-radius-0.7.5-alt1
>      ššššššššwarning: Macro %vcs not found
>      ššššššššerror: line 10: Unknown tag: %vcs [47]https://github.com/jlong/radius.git
>      ššššššššhsh-rebuild: gem-radius-0.7.5-alt1.src.rpm: failed to fetch build dependencies.
> 
>      gem-rainbow-3.0.0-alt1
>      šššššššš+ /bin/mkdir -p /usr/src/RPM/BUILD
>      šššššššš+ cd /usr/src/RPM/BUILD
>      šššššššš+ cd gem-rainbow-3.0.0
>      šššššššš+ %gem_build
>      šššššššš/usr/src/tmp/rpm-tmp.886: line 139: fg: no job control
>      ššššššššerror: Bad exit status from /usr/src/tmp/rpm-tmp.886 (%build)
>      ššššššššRPM build errors:
>      ššššššššMacro %gem_build not found
>      ššššššššMacro %gem_install not found
>      ššššššššMacro %gem_test not found
> 
>      gem-rake-13.0.1-alt1
>      ššššššššExecuting(%check): /bin/sh -e /usr/src/tmp/rpm-tmp.96238
>      šššššššš+ umask 022
>      šššššššš+ /bin/mkdir -p /usr/src/RPM/BUILD
>      šššššššš+ cd /usr/src/RPM/BUILD
>      šššššššš+ cd gem-rake-13.0.1
>      šššššššš+ %rake_test
>      šššššššš/usr/src/tmp/rpm-tmp.96238: line 143: fg: no job control
>      ššššššššerror: Bad exit status from /usr/src/tmp/rpm-tmp.96238 (%check)
>      ššššššššRPM build errors:
>      ššššššššMacro %rake_test not found
> 
>      gem-resque-2.0.0-alt1.1
>      ššššššššwarning: Macro %vcs not found
>      ššššššššerror: line 10: Unknown tag: %vcs [48]https://github.com/resque/resque.git
>      ššššššššhsh-rebuild: gem-resque-2.0.0-alt1.1.src.rpm: failed to fetch build dependencies.
> 
>      gem-rsync-1.0.9-alt1
>      ššššššššwarning: Macro %vcs not found
>      ššššššššerror: line 10: Unknown tag: %vcs [49]https://github.com/jbussdieker/ruby-rsync.git
>      ššššššššhsh-rebuild: gem-rsync-1.0.9-alt1.src.rpm: failed to fetch build dependencies.
> 
>      gem-ruby-msg-1.5.2-alt2
>      ššššššššwarning: Macro %vcs not found
>      ššššššššerror: line 10: Unknown tag: %vcs [50]https://github.com/aquasync/ruby-msg.git
>      ššššššššhsh-rebuild: gem-ruby-msg-1.5.2-alt2.src.rpm: failed to fetch build dependencies.
> 
>      gem-ruby-ole-1.2.12.2-alt1
>      ššššššššwarning: Macro %vcs not found
>      ššššššššerror: line 10: Unknown tag: %vcs [51]https://github.com/aquasync/ruby-ole.git
>      ššššššššhsh-rebuild: gem-ruby-ole-1.2.12.2-alt1.src.rpm: failed to fetch build dependencies.
> 
>      gem-rubygems-tasks-0.2.4-alt1
>      šššššššš+ cd /usr/src/RPM/BUILD
>      šššššššš+ cd gem-rubygems-tasks-0.2.4
>      šššššššš+ %gem_build
>      šššššššš/usr/src/tmp/rpm-tmp.46730: line 139: fg: no job control
>      ššššššššerror: Bad exit status from /usr/src/tmp/rpm-tmp.46730 (%build)
>      ššššššššRPM build errors:
>      ššššššššMacro %gem_build not found
>      ššššššššMacro %gem_show not found
>      ššššššššMacro %gem_install not found
>      ššššššššMacro %gem_test not found
> 
>      gem-safe-yaml-1.0.5-alt2
>      ššššššššwarning: Macro %vcs not found
>      ššššššššerror: line 11: Unknown tag: %vcs [52]https://github.com/dtao/safe_yaml.git
>      ššššššššhsh-rebuild: gem-safe-yaml-1.0.5-alt2.src.rpm: failed to fetch build dependencies.
> 
>      gem-spice-html5-rails-0.1.5-alt1
>      ššššššššwarning: Macro %vcs not found
>      ššššššššerror: line 10: Unknown tag: %vcs
>      ššššššššhsh-rebuild: gem-spice-html5-rails-0.1.5-alt1.src.rpm: failed to fetch build dependencies.
> 
>      gem-sshkit-1.18.2-alt1
>      šššššššš+ /bin/mkdir -p /usr/src/RPM/BUILD
>      šššššššš+ cd /usr/src/RPM/BUILD
>      šššššššš+ cd gem-sshkit-1.18.2
>      šššššššš+ %gem_build
>      šššššššš/usr/src/tmp/rpm-tmp.32253: line 139: fg: no job control
>      ššššššššerror: Bad exit status from /usr/src/tmp/rpm-tmp.32253 (%build)
>      ššššššššRPM build errors:
>      ššššššššMacro %gem_build not found
>      ššššššššMacro %gem_install not found
>      ššššššššMacro %gem_test not found
> 
>      gem-statsd-instrument-2.4.0-alt1
>      ššššššššwarning: Macro %vcs not found
>      ššššššššerror: line 11: Unknown tag: %vcs
>      šššššššš[53]https://github.com/Shopify/statsd-instrument.git
>      ššššššššhsh-rebuild: gem-statsd-instrument-2.4.0-alt1.src.rpm: failed to fetch build dependencies.
> 
>      gem-timeliness-0.4.3-alt1.1
>      ššššššššwarning: Macro %vcs not found
>      ššššššššerror: line 11: Unknown tag: %vcs [54]https://github.com/adzap/timeliness.git
>      ššššššššhsh-rebuild: gem-timeliness-0.4.3-alt1.1.src.rpm: failed to fetch build dependencies.
> 
>      gem-tty-color-0.5.0-alt1.1
>      ššššššššwarning: Macro %vcs not found
>      ššššššššerror: line 11: Unknown tag: %vcs [55]https://github.com/piotrmurach/tty-color.git
>      ššššššššhsh-rebuild: gem-tty-color-0.5.0-alt1.1.src.rpm: failed to fetch build dependencies.
> 
>      gem-tty-cursor-0.7.0-alt1.1
>      ššššššššwarning: Macro %vcs not found
>      ššššššššerror: line 11: Unknown tag: %vcs [56]https://github.com/piotrmurach/tty-cursor.git
>      ššššššššhsh-rebuild: gem-tty-cursor-0.7.0-alt1.1.src.rpm: failed to fetch build dependencies.
> 
>      gem-vcr-5.0.0-alt1
>      ššššššššwarning: Macro %vcs not found
>      ššššššššerror: line 10: Unknown tag: %vcs [57]https://github.com/vcr/vcr.git
>      ššššššššhsh-rebuild: gem-vcr-5.0.0-alt1.src.rpm: failed to fetch build dependencies.
> 
>      gem-vegas-0.1.11-alt1
>      šššššššš+ /bin/mkdir -p /usr/src/RPM/BUILD
>      šššššššš+ cd /usr/src/RPM/BUILD
>      šššššššš+ cd gem-vegas-0.1.11
>      šššššššš+ %gem_build
>      šššššššš/usr/src/tmp/rpm-tmp.64076: line 139: fg: no job control
>      ššššššššerror: Bad exit status from /usr/src/tmp/rpm-tmp.64076 (%build)
>      ššššššššRPM build errors:
>      ššššššššMacro %gem_build not found
>      ššššššššMacro %gem_install not found
>      ššššššššMacro %gem_test not found
> 
>      gem-webrobots-0.1.2-alt1
>      ššššššššwarning: Macro %vcs not found
>      ššššššššerror: line 11: Unknown tag: %vcs [58]https://github.com/knu/webrobots.git
>      ššššššššhsh-rebuild: gem-webrobots-0.1.2-alt1.src.rpm: failed to fetch build dependencies.
> 
>      gem-wikicloth-0.8.3-alt1
>      ššššššššwarning: Macro %vcs not found
>      ššššššššerror: line 10: Unknown tag: %vcs [59]https://github.com/nricciar/wikicloth.git
>      ššššššššhsh-rebuild: gem-wikicloth-0.8.3-alt1.src.rpm: failed to fetch build dependencies.
> 
>      gem-wisper-2.0.1-alt1
>      ššššššššwarning: Macro %vcs not found
>      ššššššššerror: line 11: Unknown tag: %vcs [60]https://github.com/krisleech/wisper.git
>      ššššššššhsh-rebuild: gem-wisper-2.0.1-alt1.src.rpm: failed to fetch build dependencies.
> 
>      maruku-0.7.3-alt2
>      ššššššššwarning: Macro %vcs not found
>      ššššššššerror: line 11: Unknown tag: %vcs [61]https://github.com/bhollis/maruku.git
>      ššššššššhsh-rebuild: maruku-0.7.3-alt2.src.rpm: failed to fetch build dependencies.
> 
>      meschach-1.2-alt1.b.3
>      ššššššššVerifying ELF objects in /usr/src/tmp/meschach-buildroot
>      šššššššš(arch=normal,fhs=normal,lfs=relaxed,lint=relaxed,rpath=normal,stack=normal,textrel=normal,unresolved=normal)
>      ššššššššverify-elf: ERROR: ./usr/lib64/libmeschach.so.0: undefined symbol: _zv_copy
>      ššššššššverify-elf: ERROR: ./usr/lib64/libmeschach.so.0: undefined symbol: zv_zero
>      ššššššššverify-elf: ERROR: ./usr/lib64/libmeschach.so.0: undefined symbol: zadd
>      ššššššššverify-elf: ERROR: ./usr/lib64/libmeschach.so.0: undefined symbol: zv_resize
>      ššššššššverify-elf: ERROR: ./usr/lib64/libmeschach.so.0: undefined symbol: zsqrt
>      ššššššššverify-elf: ERROR: ./usr/lib64/libmeschach.so.0: undefined symbol: _zm_copy
>      ššššššššverify-elf: ERROR: ./usr/lib64/libmeschach.so.0: undefined symbol: _zv_norm2
>      ššššššššverify-elf: ERROR: ./usr/lib64/libmeschach.so.0: undefined symbol: zget_col
>      ššššššššverify-elf: ERROR: ./usr/lib64/libmeschach.so.0: undefined symbol: __zzero__
>      ššššššššverify-elf: ERROR: ./usr/lib64/libmeschach.so.0: undefined symbol: _zin_prod
>      ššššššššverify-elf: ERROR: ./usr/lib64/libmeschach.so.0: undefined symbol: zabs
> 
>      mustache-1.1.1-alt1
>      ššššššššwarning: Macro %vcs not found
>      ššššššššerror: line 11: Unknown tag: %vcs [62]https://github.com/mustache/mustache.git
>      ššššššššhsh-rebuild: mustache-1.1.1-alt1.src.rpm: failed to fetch build dependencies.
> 
>      perl-Benchmark-Timer-0.7112-alt1
>      ššššššššCan't locate UNIVERSAL/require.pm in @INC (you may need to install the UNIVERSAL::require
>      ššššššššmodule) (@[63]INC contains: /usr/src/RPM/BUILD/Benchmark-Timer-0.7112/inc
>      šššššššš/usr/src/RPM/BUILD/Benchmark-Timer-0.7112/blib/lib
>      šššššššš/usr/src/RPM/BUILD/Benchmark-Timer-0.7112/blib/arch /usr/local/lib64/perl/5.34
>      šššššššš/usr/local/share/perl/5.34 /usr/lib64/perl5 /usr/share/perl5 /usr/lib64/perl5
>      šššššššš/usr/share/perl5 /etc/perl5 /usr/lib/perl5/vendor_perl .) at t/000_standard__perl_critic.t
>      ššššššššline 8.
>      ššššššššBEGIN failed--compilation aborted at t/000_standard__perl_critic.t line 8.
>      ššššššššt/000_standard__perl_critic.t ...
>      šššššššš--
>      ššššššššResult: FAIL
>      ššššššššFailed 1/9 test programs. 0/37 subtests failed.
>      ššššššššmake: *** [Makefile:783: test_dynamic] Error 255
> 
>      perl-FileHandle-Unget-0.1634-alt1
>      ššššššššCan't locate UNIVERSAL/require.pm in @INC (you may need to install the UNIVERSAL::require
>      ššššššššmodule) (@[64]INC contains: /usr/src/RPM/BUILD/FileHandle-Unget-0.1634/inc
>      šššššššš/usr/src/RPM/BUILD/FileHandle-Unget-0.1634/blib/lib
>      šššššššš/usr/src/RPM/BUILD/FileHandle-Unget-0.1634/blib/arch /usr/local/lib64/perl/5.34
>      šššššššš/usr/local/share/perl/5.34 /usr/lib64/perl5 /usr/share/perl5 /usr/lib64/perl5
>      šššššššš/usr/share/perl5 /etc/perl5 /usr/lib/perl5/vendor_perl .) at t/000_standard__perl_critic.t
>      ššššššššline 8.
>      ššššššššBEGIN failed--compilation aborted at t/000_standard__perl_critic.t line 8.
>      ššššššššt/000_standard__perl_critic.t ..
>      šššššššš--
>      ššššššššResult: FAIL
>      ššššššššFailed 1/23 test programs. 0/93 subtests failed.
>      ššššššššmake: *** [Makefile:781: test_dynamic] Error 255
> 
>      perl-Getargs-Long-1.1012-alt1
>      ššššššššCan't locate UNIVERSAL/require.pm in @INC (you may
>      ššššššššneed to install the UNIVERSAL::require module) (@[65]INC contains:
>      šššššššš/usr/src/RPM/BUILD/Getargs-Long-1.1012/inc /usr/src/RPM/BUILD/Getargs-Long-1.1012/blib/lib
>      šššššššš/usr/src/RPM/BUILD/Getargs-Long-1.1012/blib/arch /usr/local/lib64/perl/5.34
>      šššššššš/usr/local/share/perl/5.34 /usr/lib64/perl5 /usr/share/perl5 /usr/lib64/perl5
>      šššššššš/usr/share/perl5 /etc/perl5 /usr/lib/perl5/vendor_perl .) at t/000_standard__perl_critic.t
>      ššššššššline 8.
>      ššššššššBEGIN failed--compilation aborted at t/000_standard__perl_critic.t line 8.
>      ššššššššt/000_standard__perl_critic.t ...
>      šššššššš--
>      ššššššššResult: FAIL
>      ššššššššFailed 1/8 test programs. 0/64 subtests failed.
>      ššššššššmake: *** [Makefile:782: test_dynamic] Error 255
> 
>      perl-Mail-Mbox-MessageParser-1.5111-alt1
>      ššššššššCan't locate UNIVERSAL/require.pm in @INC (you may need to install the UNIVERSAL::require
>      ššššššššmodule) (@[66]INC contains: /usr/src/RPM/BUILD/Mail-Mbox-MessageParser-1.5111/inc
>      šššššššš/usr/src/RPM/BUILD/Mail-Mbox-MessageParser-1.5111/blib/lib
>      šššššššš/usr/src/RPM/BUILD/Mail-Mbox-MessageParser-1.5111/blib/arch /usr/local/lib64/perl/5.34
>      šššššššš/usr/local/share/perl/5.34 /usr/lib64/perl5 /usr/share/perl5 /usr/lib64/perl5
>      šššššššš/usr/share/perl5 /etc/perl5 /usr/lib/perl5/vendor_perl .) at t/000_standard__perl_critic.t
>      ššššššššline 8.
>      ššššššššBEGIN failed--compilation aborted at t/000_standard__perl_critic.t line 8.
>      ššššššššt/000_standard__perl_critic.t ...
>      šššššššš--
>      ššššššššResult: FAIL
>      ššššššššFailed 1/25 test programs. 0/370 subtests failed.
>      ššššššššmake: *** [Makefile:788: test_dynamic] Error 255
> 
>      puppetdb-6.13.0-alt1
>      ššššššššwarning: Macro %ruby__sitelibdir not found
>      ššššššššerror: Macro %ruby__sitelibdir not found
>      ššššššššerror: line 141: %ruby__sitelibdir/*
>      ššššššššInstalling puppetdb-6.13.0-alt1.src.rpm
> 
>      racket-7.3-alt2
>      ššššššššraco setup: 5 rendering: <pkgs>/htdp-doc/teachpack/teachpack.scrbl
>      ššššššššraco setup: 0 rendering: <pkgs>/htdp-doc/test-engine/test-engine.scrbl
>      ššššššššraco setup: 4 rendering: <pkgs>/drracket/version/tool.scrbl
>      ššššššššraco setup: 4 rendering: <pkgs>/drracket/scribblings/tools/tools.scrbl
>      ššššššššraco setup: 0 rendering: <pkgs>/trace/scribblings/trace.scrbl
>      ššššššššraco setup: 0 rendering: <pkgs>/typed-racket-doc/typed-racket/scribblings/ts-guide.scrbl
>      ššššššššmake[1]: *** [Makefile:196: install-3m] CPU time limit exceeded
>      ššššššššmake[1]: Leaving directory '/usr/src/RPM/BUILD/racket-7.3/src'
>      ššššššššmake: *** [Makefile:119: install] Error 2
>      ššššššššmake: Leaving directory '/usr/src/RPM/BUILD/racket-7.3/src'
> 
>      rails-plugin-exception_notification-4.4.0-alt1
>      ššššššššwarning: Macro %vcs not found
>      ššššššššerror: line 12: Unknown tag: %vcs
>      šššššššš[67]https://github.com/smartinez87/exception_notification.git
>      ššššššššhsh-rebuild: rails-plugin-exception_notification-4.4.0-alt1.src.rpm: failed to fetch
>      ššššššššbuild dependencies.
> 
>      ruby-activerecord-session_store-1.1.3-alt1
>      ššššššššwarning: Macro %vcs not found
>      ššššššššerror: line 11: Unknown tag: %vcs
>      šššššššš[68]https://github.com/rails/activerecord-session_store.git
>      ššššššššhsh-rebuild: ruby-activerecord-session_store-1.1.3-alt1.src.rpm: failed to fetch build
>      ššššššššdependencies.
> 
>      ruby-amazon-ec2-0.9.17-alt3
>      ššššššššrpm-build-ruby is already the newest version.
>      ššššššššE: Couldn't find package ruby-tool-setup
>      ššššššššhsh-install: Failed to calculate package file list.
> 
>      ruby-apipie-rails-0.5.16-alt1
>      ššššššššwarning: Macro %vcs not found
>      ššššššššerror: line 10: Unknown tag: %vcs [69]https://github.com/Apipie/apipie-rails.git
>      ššššššššhsh-rebuild: ruby-apipie-rails-0.5.16-alt1.src.rpm: failed to fetch build dependencies.
> 
>      ruby-artifactory-client-3.0.1-alt2
>      šššššššš+ /bin/mkdir -p /usr/src/RPM/BUILD
>      šššššššš+ cd /usr/src/RPM/BUILD
>      šššššššš+ cd ruby-artifactory-client-3.0.1
>      šššššššš+ %gem_build --use=artifactory --alias=artifactory-client
>      šššššššš/usr/src/tmp/rpm-tmp.94425: line 139: fg: no job control
>      ššššššššerror: Bad exit status from /usr/src/tmp/rpm-tmp.94425 (%build)
>      ššššššššRPM build errors:
>      ššššššššMacro %gem_build not found
>      ššššššššMacro %gem_install not found
>      ššššššššMacro %gem_test not found
> 
>      ruby-capistrano-3.11.0-alt1.1
>      ššššššššwarning: Macro %vcs not found
>      ššššššššerror: line 10: Unknown tag: %vcs [70]https://github.com/capistrano/capistrano.git
>      ššššššššhsh-rebuild: ruby-capistrano-3.11.0-alt1.1.src.rpm: failed to fetch build dependencies.
> 
>      ruby-capybara-3.29.0-alt1
>      ššššššššwarning: Macro %vcs not found
>      ššššššššerror: line 10: Unknown tag: %vcs [71]https://github.com/teamcapybara/capybara.git
>      ššššššššhsh-rebuild: ruby-capybara-3.29.0-alt1.src.rpm: failed to fetch build dependencies.
> 
>      ruby-chef-vault-3.4.5-alt1
>      šššššššš+ /bin/mkdir -p /usr/src/RPM/BUILD
>      šššššššš+ cd /usr/src/RPM/BUILD
>      šššššššš+ cd ruby-chef-vault-3.4.5
>      šššššššš+ %gem_build
>      šššššššš/usr/src/tmp/rpm-tmp.12296: line 139: fg: no job control
>      ššššššššerror: Bad exit status from /usr/src/tmp/rpm-tmp.12296 (%build)
>      ššššššššRPM build errors:
>      ššššššššMacro %gem_build not found
>      ššššššššMacro %gem_install not found
>      ššššššššMacro %gem_test not found
> 
>      ruby-coffee-script-2.4.1-alt3
>      ššššššššwarning: Macro %vcs not found
>      ššššššššerror: line 11: Unknown tag: %vcs [72]https://github.com/rails/ruby-coffee-script.git
>      ššššššššhsh-rebuild: ruby-coffee-script-2.4.1-alt3.src.rpm: failed to fetch build dependencies.
> 
>      ruby-commander-4.4.7-alt1
>      ššššššššwarning: Macro %vcs not found
>      ššššššššerror: line 10: Unknown tag: %vcs [73]https://github.com/commander-rb/commander.git
>      ššššššššhsh-rebuild: ruby-commander-4.4.7-alt1.src.rpm: failed to fetch build dependencies.
> 
>      ruby-concourse-0.26.0-alt1
>      šššššššš+ /bin/mkdir -p /usr/src/RPM/BUILD
>      šššššššš+ cd /usr/src/RPM/BUILD
>      šššššššš+ cd ruby-concourse-0.26.0
>      šššššššš+ %gem_build
>      šššššššš/usr/src/tmp/rpm-tmp.27884: line 139: fg: no job control
>      ššššššššerror: Bad exit status from /usr/src/tmp/rpm-tmp.27884 (%build)
>      ššššššššRPM build errors:
>      ššššššššMacro %gem_build not found
>      ššššššššMacro %gem_install not found
>      ššššššššMacro %gem_test not found
> 
>      ruby-configparser-0.1.7-alt1
>      šššššššš+ cd configparser-0.1.7
>      šššššššš+ /bin/chmod -c -Rf u+rwX,go-w .
>      šššššššš+ %update_setup_rb
>      šššššššš/usr/src/tmp/rpm-tmp.17111: line 145: fg: no job control
>      ššššššššerror: Bad exit status from /usr/src/tmp/rpm-tmp.17111 (%prep)
>      ššššššššRPM build errors:
>      ššššššššMacro %update_setup_rb not found
>      ššššššššMacro %gem_build not found
>      ššššššššMacro %gem_install not found
>      ššššššššMacro %gem_test not found
> 
>      ruby-daemons-1.3.1-alt1
>      ššššššššwarning: Macro %vcs not found
>      ššššššššerror: line 11: Unknown tag: %vcs [74]https://github.com/thuehlinger/daemons.git
>      ššššššššhsh-rebuild: ruby-daemons-1.3.1-alt1.src.rpm: failed to fetch build dependencies.
> 
>      ruby-dalli-2.7.10-alt1
>      šššššššš+ /bin/mkdir -p /usr/src/RPM/BUILD
>      šššššššš+ cd /usr/src/RPM/BUILD
>      šššššššš+ cd ruby-dalli-2.7.10
>      šššššššš+ %gem_build
>      šššššššš/usr/src/tmp/rpm-tmp.91314: line 139: fg: no job control
>      ššššššššerror: Bad exit status from /usr/src/tmp/rpm-tmp.91314 (%build)
>      ššššššššRPM build errors:
>      ššššššššMacro %gem_build not found
>      ššššššššMacro %gem_install not found
>      ššššššššMacro %gem_test not found
> 
>      ruby-dbus-0.15.0-alt3
>      ššššššššwarning: Macro %vcs not found
>      ššššššššerror: line 11: Unknown tag: %vcs [75]https://github.com/mvidner/ruby-dbus.git
>      ššššššššhsh-rebuild: ruby-dbus-0.15.0-alt3.src.rpm: failed to fetch build dependencies.
> 
>      ruby-deacon-1.0.0-alt2
>      ššššššššwarning: Macro %vcs not found
>      ššššššššerror: line 10: Unknown tag: %vcs [76]https://github.com/lzap/deacon.git
>      ššššššššhsh-rebuild: ruby-deacon-1.0.0-alt2.src.rpm: failed to fetch build dependencies.
> 
>      ruby-facets-3.1.0-alt2
>      ššššššššwarning: Macro %vcs not found
>      ššššššššerror: line 10: Unknown tag: %vcs [77]https://github.com/rubyworks/facets.git
>      ššššššššhsh-rebuild: ruby-facets-3.1.0-alt2.src.rpm: failed to fetch build dependencies.
> 
>      ruby-fluentd-1.9.3-alt2
>      ššššššššwarning: Macro %gem_install not found
>      ššššššššerror: Macro %rubygem_gemdir not found
>      ššššššššerror: line 51: %rubygem_gemdir/*
>      ššššššššInstalling ruby-fluentd-1.9.3-alt2.src.rpm
> 
>      ruby-highline-1:2.0.2-alt1
>      ššššššššwarning: Macro %vcs not found
>      ššššššššerror: line 11: Unknown tag: %vcs [78]https://github.com/JEG2/highline.git
>      ššššššššhsh-rebuild: ruby-highline-2.0.2-alt1.src.rpm: failed to fetch build dependencies.
> 
>      ruby-hirb-0.7.3-alt2
>      ššššššššwarning: Macro %vcs not found
>      ššššššššerror: line 10: Unknown tag: %vcs [79]https://github.com/cldwalker/hirb.git
>      ššššššššhsh-rebuild: ruby-hirb-0.7.3-alt2.src.rpm: failed to fetch build dependencies.
> 
>      ruby-ipaddress-0.8.3-alt1
>      ššššššššwarning: Macro %ruby_ri_sitedir not found
>      ššššššššerror: Macro %rubygem_specdir not found
>      ššššššššerror: line 54: %rubygem_specdir/*
>      ššššššššInstalling ruby-ipaddress-0.8.3-alt1.src.rpm
> 
>      ruby-iso8601-0.12.1-alt1
>      ššššššššrpm-build-ruby is already the newest version.
>      ššššššššE: Couldn't find package ruby-tool-setup
>      ššššššššhsh-install: Failed to calculate package file list.
> 
>      ruby-java-0.0.2-alt4
>      ššššššššrpm-build-ruby is already the newest version.
>      ššššššššE: Couldn't find package ruby-tool-setup
>      ššššššššhsh-install: Failed to calculate package file list.
> 
>      ruby-launchy-2.4.3-alt3
>      ššššššššwarning: Macro %vcs not found
>      ššššššššerror: line 11: Unknown tag: %vcs [80]https://github.com/copiousfreetime/launchy.git
>      ššššššššhsh-rebuild: ruby-launchy-2.4.3-alt3.src.rpm: failed to fetch build dependencies.
> 
>      ruby-logging-2.2.2-alt2
>      ššššššššwarning: Macro %vcs not found
>      ššššššššerror: line 10: Unknown tag: %vcs [81]https://github.com/TwP/logging.git
>      ššššššššhsh-rebuild: ruby-logging-2.2.2-alt2.src.rpm: failed to fetch build dependencies.
> 
>      ruby-makeconf-0.3.0-alt2.svn20130509
>      ššššššššwarning: Macro %ruby_ri_sitedir not found
>      ššššššššerror: Macro %rubygem_specdir not found
>      ššššššššerror: line 58: %rubygem_specdir/*
>      ššššššššInstalling ruby-makeconf-0.3.0-alt2.svn20130509.src.rpm
> 
>      ruby-minitar-0.9-alt1
>      ššššššššwarning: Macro %vcs not found
>      ššššššššerror: line 10: Unknown tag: %vcs [82]https://github.com/halostatue/minitar/.git
>      ššššššššhsh-rebuild: ruby-minitar-0.9-alt1.src.rpm: failed to fetch build dependencies.
> 
>      ruby-multi_xml-0.6.0-alt2
>      ššššššššwarning: Macro %vcs not found
>      ššššššššerror: line 10: Unknown tag: %vcs [83]https://github.com/sferik/multi_xml.git
>      ššššššššhsh-rebuild: ruby-multi_xml-0.6.0-alt2.src.rpm: failed to fetch build dependencies.
> 
>      ruby-native-package-installer-1.0.7-alt1
>      šššššššš+ /bin/mkdir -p /usr/src/RPM/BUILD
>      šššššššš+ cd /usr/src/RPM/BUILD
>      šššššššš+ cd ruby-native-package-installer-1.0.7
>      šššššššš+ %gem_build
>      šššššššš/usr/src/tmp/rpm-tmp.19748: line 139: fg: no job control
>      ššššššššerror: Bad exit status from /usr/src/tmp/rpm-tmp.19748 (%build)
>      ššššššššRPM build errors:
>      ššššššššMacro %gem_build not found
>      ššššššššMacro %gem_install not found
>      ššššššššMacro %gem_test not found
> 
>      ruby-net-telnet-0.2.0-alt1
>      ššššššššwarning: Macro %rake_test not found
>      ššššššššerror: Macro %rubygem_specdir not found
>      ššššššššerror: line 59: %rubygem_specdir/*
>      ššššššššInstalling ruby-net-telnet-0.2.0-alt1.src.rpm
> 
>      ruby-open4-1.3.4-alt1
>      ššššššššwarning: Macro %vcs not found
>      ššššššššerror: line 11: Unknown tag: %vcs [84]https://github.com/ahoward/open4.git
>      ššššššššhsh-rebuild: ruby-open4-1.3.4-alt1.src.rpm: failed to fetch build dependencies.
> 
>      ruby-parse-cron-0.1.4-alt1.1
>      ššššššššrpm-build-ruby is already the newest version.
>      ššššššššE: Couldn't find package ruby-tool-setup
>      ššššššššhsh-install: Failed to calculate package file list.
> 
>      ruby-pathspec-0.2.2-alt0.1
>      ššššššššwarning: Macro %vcs not found
>      ššššššššerror: line 10: Unknown tag: %vcs [85]https://github.com/highb/pathspec-ruby.git
>      ššššššššhsh-rebuild: ruby-pathspec-0.2.2-alt0.1.src.rpm: failed to fetch build dependencies.
> 
>      ruby-polyglot-0.3.5-alt1.1
>      ššššššššrpm-build-ruby is already the newest version.
>      ššššššššE: Couldn't find package ruby-tool-setup
>      ššššššššhsh-install: Failed to calculate package file list.
> 
>      ruby-pundit-2.0.1-alt1
>      ššššššššwarning: Macro %ruby_test_unit not found
>      ššššššššerror: Macro %rubygem_specdir not found
>      ššššššššerror: line 53: %rubygem_specdir/*
>      ššššššššInstalling ruby-pundit-2.0.1-alt1.src.rpm
> 
>      ruby-puppet-lint-3.0.1-alt0.1
>      ššššššššwarning: Macro %vcs not found
>      ššššššššerror: line 10: Unknown tag: %vcs [86]https://github.com/rodjek/puppet-lint.git
>      ššššššššhsh-rebuild: ruby-puppet-lint-3.0.1-alt0.1.src.rpm: failed to fetch build dependencies.
> 
>      ruby-rack-accept-0.4.5-alt1
>      ššššššššwarning: Macro %ruby_test_unit not found
>      ššššššššerror: Macro %rubygem_specdir not found
>      ššššššššerror: line 51: %rubygem_specdir/*
>      ššššššššInstalling ruby-rack-accept-0.4.5-alt1.src.rpm
> 
>      ruby-rack-test-1.1.0-alt2
>      ššššššššwarning: Macro %vcs not found
>      ššššššššerror: line 10: Unknown tag: %vcs [87]https://github.com/rack-test/rack-test.git
>      ššššššššhsh-rebuild: ruby-rack-test-1.1.0-alt2.src.rpm: failed to fetch build dependencies.
> 
>      ruby-rexical-1.0.7-alt1.1
>      ššššššššwarning: Macro %vcs not found
>      ššššššššerror: line 10: Unknown tag: %vcs [88]https://github.com/tenderlove/rexical.git
>      ššššššššhsh-rebuild: ruby-rexical-1.0.7-alt1.1.src.rpm: failed to fetch build dependencies.
> 
>      ruby-rgen-0.8.4-alt2
>      šššššššš+ /bin/mkdir -p /usr/src/RPM/BUILD
>      šššššššš+ cd /usr/src/RPM/BUILD
>      šššššššš+ cd rgen-0.8.4
>      šššššššš+ %gem_build
>      šššššššš/usr/src/tmp/rpm-tmp.29599: line 139: fg: no job control
>      ššššššššerror: Bad exit status from /usr/src/tmp/rpm-tmp.29599 (%build)
>      ššššššššRPM build errors:
>      ššššššššMacro %gem_build not found
>      ššššššššMacro %gem_install not found
>      ššššššššMacro %gem_test not found
> 
>      ruby-rspec-puppet-2.7.5-alt1
>      ššššššššwarning: Macro %vcs not found
>      ššššššššerror: line 10: Unknown tag: %vcs [89]https://github.com/rodjek/rspec-puppet.git
>      ššššššššhsh-rebuild: ruby-rspec-puppet-2.7.5-alt1.src.rpm: failed to fetch build dependencies.
> 
>      ruby-rubygems-update-3.0.4-alt1
>      ššššššššwarning: Macro %vcs not found
>      ššššššššerror: line 10: Unknown tag: %vcs [90]https://github.com/rubygems/rubygems.git
>      ššššššššhsh-rebuild: ruby-rubygems-update-3.0.4-alt1.src.rpm: failed to fetch build dependencies.
> 
>      ruby-search_cop-1.0.5-alt1
>      ššššššššwarning: Macro %ruby_test_unit not found
>      ššššššššerror: Macro %rubygem_specdir not found
>      ššššššššerror: line 52: %rubygem_specdir/*
>      ššššššššInstalling ruby-search_cop-1.0.5-alt1.src.rpm
> 
>      ruby-secure-headers-6.1.1-alt1
>      ššššššššwarning: Macro %vcs not found
>      ššššššššerror: line 11: Unknown tag: %vcs [91]https://github.com/twitter/secureheaders.git
>      ššššššššhsh-rebuild: ruby-secure-headers-6.1.1-alt1.src.rpm: failed to fetch build dependencies.
> 
>      ruby-sprockets-rails-3.2.1-alt3
>      ššššššššwarning: Macro %vcs not found
>      ššššššššerror: line 10: Unknown tag: %vcs [92]https://github.com/rails/sprockets-rails.git
>      ššššššššhsh-rebuild: ruby-sprockets-rails-3.2.1-alt3.src.rpm: failed to fetch build dependencies.
> 
>      ruby-term-ansicolor-1.7.1-alt1
>      šššššššš+ /bin/mkdir -p /usr/src/RPM/BUILD
>      šššššššš+ cd /usr/src/RPM/BUILD
>      šššššššš+ cd ruby-term-ansicolor-1.7.1
>      šššššššš+ %gem_build
>      šššššššš/usr/src/tmp/rpm-tmp.11323: line 139: fg: no job control
>      ššššššššerror: Bad exit status from /usr/src/tmp/rpm-tmp.11323 (%build)
>      ššššššššRPM build errors:
>      ššššššššMacro %gem_build not found
>      ššššššššMacro %gem_install not found
>      ššššššššMacro %gem_test not found
> 
>      ruby-thread-safe-0.3.6-alt2
>      ššššššššwarning: Macro %vcs not found
>      ššššššššerror: line 11: Unknown tag: %vcs
>      šššššššš[93]https://github.com/ruby-concurrency/thread_safe.git
>      ššššššššhsh-rebuild: ruby-thread-safe-0.3.6-alt2.src.rpm: failed to fetch build dependencies.
> 
>      ruby-tins-1.20.2-alt1
>      šššššššš+ /bin/mkdir -p /usr/src/RPM/BUILD
>      šššššššš+ cd /usr/src/RPM/BUILD
>      šššššššš+ cd ruby-tins-1.20.2
>      šššššššš+ %gem_build
>      šššššššš/usr/src/tmp/rpm-tmp.99697: line 139: fg: no job control
>      ššššššššerror: Bad exit status from /usr/src/tmp/rpm-tmp.99697 (%build)
>      ššššššššRPM build errors:
>      ššššššššMacro %gem_build not found
>      ššššššššMacro %gem_install not found
>      ššššššššMacro %gem_test not found
> 
>      ruby-treetop-1:1.6.10-alt2
>      ššššššššwarning: Macro %vcs not found
>      ššššššššerror: line 11: Unknown tag: %vcs [94]https://github.com/cjheath/treetop.git
>      ššššššššhsh-rebuild: ruby-treetop-1.6.10-alt2.src.rpm: failed to fetch build dependencies.
> 
>      ruby-turbolinks-1:5.2.1-alt1
>      ššššššššwarning: Macro %vcs not found
>      ššššššššerror: line 11: Unknown tag: %vcs [95]https://github.com/turbolinks/turbolinks.git
>      ššššššššhsh-rebuild: ruby-turbolinks-5.2.1-alt1.src.rpm: failed to fetch build dependencies.
> 
>      ruby-turbolinks-source-gem-5.2.0-alt2
>      ššššššššwarning: Macro %vcs not found
>      ššššššššerror: line 11: Unknown tag: %vcs
>      šššššššš[96]https://github.com/turbolinks/turbolinks-source-gem.git
>      ššššššššhsh-rebuild: ruby-turbolinks-source-gem-5.2.0-alt2.src.rpm: failed to fetch build
>      ššššššššdependencies.
> 
>      ruby-uuidtools-2.1.5-alt2
>      ššššššššwarning: Macro %vcs not found
>      ššššššššerror: line 11: Unknown tag: %vcs [97]http://github.com/sporkmonger/uuidtools.git
>      ššššššššhsh-rebuild: ruby-uuidtools-2.1.5-alt2.src.rpm: failed to fetch build dependencies.
> 
>      ruby-warden-1.2.8-alt1
>      ššššššššwarning: Macro %vcs not found
>      ššššššššerror: line 11: Unknown tag: %vcs [98]https://github.com/wardencommunity/warden.git
>      ššššššššhsh-rebuild: ruby-warden-1.2.8-alt1.src.rpm: failed to fetch build dependencies.
> 
>      ruby-xmlrpc-0.3.0-alt1
>      ššššššššwarning: Macro %rake_test not found
>      ššššššššerror: Macro %rubygem_specdir not found
>      ššššššššerror: line 62: %rubygem_specdir/*
>      ššššššššInstalling ruby-xmlrpc-0.3.0-alt1.src.rpm
> 
>      xapian-bindings-1.4.15-alt2
>      šššššššš<13>Sep 2 05:35:26 rpmi: rpm-macros-ruby-1:1.0.0-alt15 sisyphus+276204.60.14.1
>      šššššššš1630427685 installed
>      ššššššššsh: /usr/bin/ruby: No such file or directory
>      ššššššššwarning: Macro %ruby__sitelibdir not found
>      šššššššš--
>      ššššššššWrote: /usr/src/in/nosrpm/xapian-bindings-1.4.15-alt2.nosrc.rpm (w1.gzdio)
>      ššššššššerror: Macro %ruby__sitelibdir not found
>      ššššššššerror: line 132: %ruby__sitelibdir/xapian.rb
>      ššššššššInstalling xapian-bindings-1.4.15-alt2.src.rpm
> 
>      šššššššš27 error logs REMOVED from the list
>      ModemManager-1.16.10-alt1
>      chromium-92.0.4515.159-alt3
>      chrony-4.1-alt1
>      clisp-1:2.49.92-alt2
>      coturn-4.5.1.1-alt3
>      dmraid-1.0.0.rc16-alt2
>      gawk-5.1.0.0.213.d04f-alt1
>      java-9-openjdk-0:9.0.4.11-alt8_6jpp9
>      libbenchmark-1.5.6-alt1
>      libpsl-native-7.1.0-alt1
>      libselinux-1:3.2-alt1
>      libsemanage-1:3.2-alt1
>      libsepol-1:3.2-alt1
>      libsidplayfp-1.8.7-alt1
>      libsmi-0.5.0-alt2
>      libspf2-1.2.10-alt3
>      libtorrent-3:0.13.8-alt1
>      mswatch-1.2.0-alt1.svn20120312.1
>      pnetcdf-1.8.1-alt2.3
>      ruby-2.7.3-alt1.3
>      ruby-cconfig-1.2.1-alt1
>      ruby-sinatra-1:2.0.5-alt1
>      shared-mime-info-2.1-alt1
>      supertuxkart-1.2-alt3.1
>      totem-3.38.1-alt1
>      util-linux-2.37.2-alt2
>      valgrind-3.17.0-alt2
> 
>      Total 558 error logs.
> 
>      ----- End forwarded message -----
> 
>      --
>      ldv
>      _______________________________________________
>      Devel mailing list
>      [99]Devel ÎÁ lists.altlinux.org
>      [100]https://lists.altlinux.org/mailman/listinfo/devel
> 
>    š
>    in progress

đĎÖÁĚŐĘÓÔÁ, ÎĹ ŰĚÉÔĹ ĐÉÓŘÍÁ × html-ĆĎŇÍÁÔĹ É ÂĹÚ ÔĹËÓÔĎ×ĎĘ ×ĹŇÓÉÉ. îŐ
ÉÍĹĘÔĹ ÖĹ Ő×ÁÖĹÎÉĹ. üÔĎ ÎĹ×ĎÚÍĎÖÎĎ ŢÉÔÁÔŘ.

-- 
Rgrds, legion



đĎÄŇĎÂÎÁŃ ÉÎĆĎŇÍÁĂÉŃ Ď ÓĐÉÓËĹ ŇÁÓÓŮĚËÉ Devel