[devel] rpm-build-4.0.4-alt78 beehive_status
Alexey Tourbin
=?iso-8859-1?q?at_=CE=C1_altlinux=2Eru?=
Вс Сен 9 23:45:13 MSD 2007
On Sun, Sep 09, 2007 at 10:19:38PM +0400, Alexey Tourbin wrote:
> Вот список не собравшихся пакетов (по сравнению с плановой пересборкой).
Вот этот же самый список с диагностикой, отформатированный при помощи
скрипта beehive_status из qa-robot.git.
I: Sisyphus-20070909 beehive_status: +46 (106)
46 NEW error logs
AutoScan-1.01-alt1
find-requires: running scripts
(files,lib,pam,perl,pkgconfig,python,shebang,shell,static,symlinks,tcl)
/usr/lib/rpm/tcl.req: line 3: /usr/bin/tclsh: No such file or directory
/usr/lib/rpm/tcl.req: line 3: exec: /usr/bin/tclsh: cannot execute: No such file or
directory
error: /bin/sh failed
error: Failed to find Requires
RPM build errors:
GroupUserFolder-3.2-alt1.1
(Missing operator before $?)
syntax error at
/usr/src/tmp/GroupUserFolder-buildroot/usr/lib/zope/lib/python/Products/GroupUserFolder/cvs2cl.pl
line 2, near "$0 $"
/usr/src/tmp/GroupUserFolder-buildroot/usr/lib/zope/lib/python/Products/GroupUserFolder/cvs2cl.pl
had compilation errors.
#
/usr/src/tmp/GroupUserFolder-buildroot/usr/lib/zope/lib/python/Products/GroupUserFolder/cvs2cl.pl:
deparse failed. isPerl=0.0337665222703543.
error: /bin/sh failed
error: Failed to find Requires
RPM build errors:
ORBit2-2.14.7-alt1
Testing Async invocations ...
** ERROR **: file client.c: line 1982 (testAsync): assertion failed: (ev->_major ==
CORBA_NO_EXCEPTION)
aborting...
././test.sh: line 24: 30519 Aborted ./client $1
Test failed with params: --ORBIIOPIPv4=1 --ORBIIOPUSock=0 --ORBCorbaloc=1
if this is an IPv4 test, can you ping apiary.office.altlinux.org ?
FAIL: ./test.sh
1 of 1 tests failed
Please report to http://bugzilla.gnome.org/enter_bug.cgi?product=ORBit2
TclTutor-2.0-alt0.2
find-requires: running scripts
(files,lib,pam,perl,pkgconfig,python,shebang,shell,static,symlinks,tcl)
/usr/lib/rpm/tcl.req: line 3: /usr/bin/tclsh: No such file or directory
/usr/lib/rpm/tcl.req: line 3: exec: /usr/bin/tclsh: cannot execute: No such file or
directory
error: /bin/sh failed
RPM build errors:
error: Failed to find Requires
/bin/sh failed
Zope-2.7.7-alt1
/usr/lib/rpm/python.req.py:
/usr/src/tmp/Zope-buildroot/usr/lib/python2.4/site-packages/ZPublisher/xmlrpc.py:
line=157 IGNORE module=traceback
/usr/src/tmp/Zope-buildroot/usr/lib/python2.4/site-packages/ZPublisher/Client.py:
line 47: syntax error near unexpected token `('
/usr/src/tmp/Zope-buildroot/usr/lib/python2.4/site-packages/ZPublisher/Client.py: line 47:
`class BadReply(Exception):'
error: /bin/sh failed
error: Failed to find Requires
RPM build errors:
alterator-firewall-0.5-alt3
shell.req:
/usr/src/tmp/alterator-firewall-buildroot/usr/lib/alterator/backend3/template-oldfw:
message_loop not found (skip)
/usr/lib/rpm/tcl.req: line 3: /usr/bin/tclsh: No such file or directory
/usr/lib/rpm/tcl.req: line 3: exec: /usr/bin/tclsh: cannot execute: No such file or
directory
error: /bin/sh failed
error: Failed to find Requires
RPM build errors:
carol-0:2.2.7-alt1_1jpp1.7
[junit] Tests run: 11, Failures: 0, Errors: 0, Time elapsed: 2.912 sec
[junit] Exception in thread "main" java.lang.OutOfMemoryError: unable to create new
native thread
[junit] at java.lang.Thread.start(Native Method)
--
[junit] Tests run: 11, Failures: 1, Errors: 1, Time elapsed: 3.428 sec
[junit] Test org.objectweb.carol.jtests.conform.basic.clients.MultiProtocolTests FAILED
process.stopper:
--
process.stopper:
hasher-priv: master: idle time limit (3600 seconds) exceeded
cherry-2.0.cvs20060301-alt1
(Missing operator before ?)
syntax error at /usr/src/tmp/cherry-buildroot/usr/lib/cherry/tariffsrv/CALC.pl line 2,
near "/bin/sh "
/usr/src/tmp/cherry-buildroot/usr/lib/cherry/tariffsrv/CALC.pl had compilation errors.
# /usr/src/tmp/cherry-buildroot/usr/lib/cherry/tariffsrv/CALC.pl: deparse
failed. isPerl=0.00157232704402516.
error: /bin/sh failed
error:
devhelp-0.14-alt1
find-provides: running scripts (alternatives,lib,pam,perl,pkgconfig,python,shell,tcl)
Package libgnomeui-2.0 was not found in the pkg-config search path.
Perhaps you should add the directory containing `libgnomeui-2.0.pc'
to the PKG_CONFIG_PATH environment variable
Package 'libgnomeui-2.0', required by 'devhelp', not found
RPM build errors:
error: /bin/sh failed
error: Failed to find Provides
/bin/sh failed
eciadsl-usermode-0.11beta1-alt1
shell.req: /usr/src/tmp/eciadsl-usermode-buildroot/usr/bin/eciadsl-start: fatal not found
(skip)
/usr/lib/rpm/tcl.req: line 3: /usr/bin/tclsh: No such file or directory
/usr/lib/rpm/tcl.req: line 3: exec: /usr/bin/tclsh: cannot execute: No such file or
directory
RPM build errors:
error: /bin/sh failed
error: Failed to find Requires
/bin/sh failed
fedora-ds-adminutil-1.1.2-alt1.20070817
find-provides: running scripts (alternatives,lib,pam,perl,pkgconfig,python,shell,tcl)
Package icu was not found in the pkg-config search path.
Perhaps you should add the directory containing `icu.pc'
to the PKG_CONFIG_PATH environment variable
Package 'icu', required by 'adminutil', not found
error: /bin/sh failed
error: Failed to find Provides
RPM build errors:
freesci-0.3.5-alt2
find-requires: running scripts
(files,lib,pam,perl,pkgconfig,python,shebang,shell,static,symlinks,tcl)
/usr/lib/rpm/tcl.req: line 3: /usr/bin/tclsh: No such file or directory
/usr/lib/rpm/tcl.req: line 3: exec: /usr/bin/tclsh: cannot execute: No such file or
directory
error: /bin/sh failed
error: Failed to find Requires
RPM build errors:
fvwm-tcl-1.2-alt1
find-provides: running scripts (alternatives,lib,pam,perl,pkgconfig,python,shell,tcl)
/usr/lib/rpm/tcl.prov: line 3: /usr/bin/tclsh: No such file or directory
/usr/lib/rpm/tcl.prov: line 3: exec: /usr/bin/tclsh: cannot execute: No such file
or directory
RPM build errors:
error: /bin/sh failed
error: Failed to find Provides
/bin/sh failed
geany-0.11-alt1
find-requires: running scripts
(files,lib,pam,perl,pkgconfig,python,shebang,shell,static,symlinks,tcl)
/usr/lib/rpm/tcl.req: line 3: /usr/bin/tclsh: No such file or directory
/usr/lib/rpm/tcl.req: line 3: exec: /usr/bin/tclsh: cannot execute: No such file or
directory
RPM build errors:
error: /bin/sh failed
error: Failed to find Requires
/bin/sh failed
geda-utils-20070526-alt1
MemoryError
error: /bin/sh failed
error: Failed to find Requires
RPM build errors:
gettext-0.14.6-alt2
shell.req: /usr/src/tmp/gettext-buildroot/usr/bin/gettextize: func_modify_Makefile_am
not found (skip)
/usr/lib/rpm/tcl.req: line 3: /usr/bin/tclsh: No such file or directory
/usr/lib/rpm/tcl.req: line 3: exec: /usr/bin/tclsh: cannot execute: No such file or
directory
error: /bin/sh failed
error: Failed to find Requires
RPM build errors:
git-1.5.3.1-alt1
find-requires: running scripts
(files,lib,pam,perl,pkgconfig,python,shebang,shell,static,symlinks,tcl)
/usr/lib/rpm/tcl.req: line 3: /usr/bin/tclsh: No such file or directory
/usr/lib/rpm/tcl.req: line 3: exec: /usr/bin/tclsh: cannot execute: No such file or
directory
error: /bin/sh failed
RPM build errors:
error: Failed to find Requires
/bin/sh failed
gsm-tools-0.0.4-alt5
find-provides: running scripts (alternatives,lib,pam,perl,pkgconfig,python,shell,tcl)
/usr/lib/rpm/tcl.prov: line 3: /usr/bin/tclsh: No such file or directory
/usr/lib/rpm/tcl.prov: line 3: exec: /usr/bin/tclsh: cannot execute: No such file
or directory
error: /bin/sh failed
error: Failed to find Provides
RPM build errors:
jakarta-commons-latka-0:1.0-alt2_0.r389670.2jpp1.7
find-requires: running scripts
(files,lib,pam,perl,pkgconfig,python,shebang,shell,static,symlinks,tcl)
/usr/src/tmp/jakarta-commons-latka-buildroot/usr/share/jakarta-commons-latka-1.0/bin/latka.sh:
line 19: syntax error near unexpected token `do
'
/usr/src/tmp/jakarta-commons-latka-buildroot/usr/share/jakarta-commons-latka-1.0/bin/latka.sh:
line 19: `do
'
error: /bin/sh failed
error: Failed to find Requires
RPM build errors:
kdesdk-3.5.7-alt1
/usr/src/tmp/kdesdk-buildroot/usr/bin/svnlastchange syntax OK
/usr/src/tmp/kdesdk-buildroot/usr/bin/kde-build: line 839: syntax error near unexpected
token `|'
/usr/src/tmp/kdesdk-buildroot/usr/bin/kde-build: line 839: ` |'
RPM build errors:
error: /bin/sh failed
error: Failed to find Requires
/bin/sh failed
koules-1.4-alt5
gccmakedep -- -Ixlib -I/usr/include -I/usr/include -Dlinux -D__i386__
-D_POSIX_C_SOURCE=199309L -D_POSIX_SOURCE
-D_XOPEN_SOURCE -D_BSD_SOURCE
-D_SVID_SOURCE -D_LARGEFILE_SOURCE -D_FILE_OFFSET_BITS=64
-DFUNCPROTO=15 -DNARROWPROTO -DSOUND -DJOYSTICK -DNETSUPPORT -DMITSHM -DHAVEUSLEEP -Wall
-ffast-math -Ixlib -DASSEMBLY -DSOUNDSERVER=\"/usr/games/koules.sndsrv.linux\"
-DSOUNDDIR=\"/usr/share/games/koules\" -DSOUNDDEV=\"/dev/dsp\" -- koules.c menu.c
gameplan.c font.c intro.c rcfiles.c framebuffer.c cmap-x11.c sound.c nas_sound.c
rsound.c client.c server.c sock.c objectsio.c mygetopt.c
rm: cannot remove `mdep27049.tmp': No such file or directory
rm: cannot remove `Makefile.bak': No such file or directory
rm: cannot remove `mdep27049.tmp*': No such file or directory
make: Leaving directory `/usr/src/RPM/BUILD/koules1.4'
--
shell.req: /usr/src/tmp/koules-buildroot/usr/games/koules: mainmenu not found (skip)
/usr/lib/rpm/tcl.req: line 3: /usr/bin/tclsh: No such file or directory
/usr/lib/rpm/tcl.req: line 3: exec: /usr/bin/tclsh: cannot execute: No such file or
directory
RPM build errors:
error: /bin/sh failed
error: Failed to find Requires
/bin/sh failed
lazarus-0.9.22-alt1
(Missing operator before $?)
syntax error at /usr/src/tmp/lazarus-buildroot/usr/lib/lazarus/tools/cvs2cl.pl line 2,
near "$0 $"
/usr/src/tmp/lazarus-buildroot/usr/lib/lazarus/tools/cvs2cl.pl had compilation errors.
--
RPM build errors:
error: /bin/sh failed
error: Failed to find Requires
/bin/sh failed
libalut-1.1.0-alt1.2
find-provides: running scripts (alternatives,lib,pam,perl,pkgconfig,python,shell,tcl)
Package libopenal was not found in the pkg-config search path.
Perhaps you should add the directory containing `libopenal.pc'
to the PKG_CONFIG_PATH environment variable
Package 'libopenal', required by 'freealut', not found
RPM build errors:
error: /bin/sh failed
error: Failed to find Provides
/bin/sh failed
libgtkmathview-0.7.7-alt1
find-provides: running scripts (alternatives,lib,pam,perl,pkgconfig,python,shell,tcl)
Package mathmlview-backend-gtk was not found in the pkg-config search path.
Perhaps you should add the directory containing `mathmlview-backend-gtk.pc'
to the PKG_CONFIG_PATH environment variable
Package 'mathmlview-backend-gtk', required by 'GtkMathView', not found
RPM build errors:
error: /bin/sh failed
error: Failed to find Provides
/bin/sh failed
libopenal-0.0.8-alt3
./usr/lib:
/sbin/ldconfig: Cannot stat ./usr/lib/libopenal.so: No such file or directory
/sbin/ldconfig: Cannot stat ./usr/lib/libopenal.so.0: No such file or directory
libopenal.so.0 -> libopenal.so.0.0.0 (changed)
--
find-provides: running scripts (alternatives,lib,pam,perl,pkgconfig,python,shell,tcl)
Package @requirements@ was not found in the pkg-config search path.
Perhaps you should add the directory containing `@requirements на .pc'
to the PKG_CONFIG_PATH environment variable
Package '@requirements@', required by 'OpenAL', not found
error: /bin/sh failed
error: Failed to find Provides
RPM build errors:
libunwind-0.99-alt1
latex2man -t ./libunwind.trans unw_create_addr_space.tex unw_create_addr_space.man
make[1]: latex2man: Command not found
make[1]: Leaving directory `/usr/src/RPM/BUILD/libunwind-0.99-alpha/doc'
ltsp5-5.0-alt0.44
symlinks.req: /usr/src/tmp/ltsp5-buildroot/etc/X11/xorg.conf.auto:
/var/cache/ltspconf/xorg.conf -> /var/cache/ltspconf/xorg.conf (raw, not found)
/usr/lib/rpm/tcl.req: line 3: /usr/bin/tclsh: No such file or directory
/usr/lib/rpm/tcl.req: line 3: exec: /usr/bin/tclsh: cannot execute: No such file or
directory
RPM build errors:
error: /bin/sh failed
error: Failed to find Requires
/bin/sh failed
micq-0.5.0.3-alt1.1
find-requires: running scripts
(files,lib,pam,perl,pkgconfig,python,shebang,shell,static,symlinks,tcl)
/usr/lib/rpm/tcl.req: line 3: /usr/bin/tclsh: No such file or directory
/usr/lib/rpm/tcl.req: line 3: exec: /usr/bin/tclsh: cannot execute: No such file or
directory
RPM build errors:
error: /bin/sh failed
error: Failed to find Requires
File listed twice: /usr/share/micq/contrib
nemerle-0.9.3.99.6733-alt2.1
** (process:13190): WARNING **: Missing method .ctor in assembly
/usr/src/tmp/nemerle-buildroot/usr/lib/mono/gac/Nemerle.Macros/0.9.3.19849__5291d186334f6101/Nemerle.Macros.dll,
type Nemerle.Internal.OperatorAttribute
** ERROR **: Can't find custom attr constructor image:
/usr/src/tmp/nemerle-buildroot/usr/lib/mono/gac/Nemerle.Macros/0.9.3.19849__5291d186334f6101/Nemerle.Macros.dll
mtoken: 0x0a0002e2
aborting...
error: /bin/sh failed
error:
openmpi-1.2.3-alt4
find-requires: running scripts
(files,lib,pam,perl,pkgconfig,python,shebang,shell,static,symlinks,tcl)
/usr/lib/rpm/tcl.req: line 3: /usr/bin/tclsh: No such file or directory
/usr/lib/rpm/tcl.req: line 3: exec: /usr/bin/tclsh: cannot execute: No such file or
directory
error: /bin/sh failed
error: Failed to find Requires
RPM build errors:
perl-WWW-Mechanize-1.18-alt1
t/local/back............# Started http://localhost:56839/
# Failed test '404 check'
# at t/local/back.t line 148.
--
dubious
Test returned status 1 (wstat 256, 0x100)
DIED. FAILED test 28
Failed 1/38 tests, 97.37% okay (less 2 skipped tests: 35 okay, 92.11%)
--
9 tests and 10 subtests skipped.
Failed 1/40 test scripts. 1/448 subtests failed.
Files=40, Tests=448, 188 wallclock secs ( 5.38 cusr + 0.54 csys = 5.92 CPU)
Failed 1/40 test programs. 1/448 subtests failed.
make: *** [test_dynamic] Error 255
planner-0.14.2-alt3
find-provides: running scripts (alternatives,lib,pam,perl,pkgconfig,python,shell,tcl)
Package libgsf-1 was not found in the pkg-config search path.
Perhaps you should add the directory containing `libgsf-1.pc'
to the PKG_CONFIG_PATH environment variable
Package 'libgsf-1', required by 'libplanner', not found
RPM build errors:
error: /bin/sh failed
error: Failed to find Provides
File listed twice: /usr/share/gnome/help/planner
python-module-gst-0.10.8-alt1
find-provides: running scripts (alternatives,lib,pam,perl,pkgconfig,python,shell,tcl)
Package pygtk-2.0 was not found in the pkg-config search path.
Perhaps you should add the directory containing `pygtk-2.0.pc'
to the PKG_CONFIG_PATH environment variable
Package 'pygtk-2.0', required by 'gst-python', not found
RPM build errors:
error: /bin/sh failed
error: Failed to find Provides
/bin/sh failed
remind-03.01.00-alt1
find-requires: running scripts
(files,lib,pam,perl,pkgconfig,python,shebang,shell,static,symlinks,tcl)
/usr/lib/rpm/tcl.req: line 3: /usr/bin/tclsh: No such file or directory
/usr/lib/rpm/tcl.req: line 3: exec: /usr/bin/tclsh: cannot execute: No such file or
directory
error: /bin/sh failed
RPM build errors:
error: Failed to find Requires
/bin/sh failed
rp-pppoe-3.7-alt2
find-requires: running scripts
(files,lib,pam,perl,pkgconfig,python,shebang,shell,static,symlinks,tcl)
/usr/lib/rpm/tcl.req: line 3: /usr/bin/tclsh: No such file or directory
/usr/lib/rpm/tcl.req: line 3: exec: /usr/bin/tclsh: cannot execute: No such file or
directory
error: /bin/sh failed
RPM build errors:
error: Failed to find Requires
Macro %b not found
sandman-0.5.6-alt1
find-provides: running scripts (alternatives,lib,pam,perl,pkgconfig,python,shell,tcl)
/usr/lib/rpm/tcl.prov: line 3: /usr/bin/tclsh: No such file or directory
/usr/lib/rpm/tcl.prov: line 3: exec: /usr/bin/tclsh: cannot execute: No such file
or directory
RPM build errors:
error: /bin/sh failed
error: Failed to find Provides
/bin/sh failed
seiros-pbx-fax-1.1-alt1
find-requires: running scripts
(files,lib,pam,perl,pkgconfig,python,shebang,shell,static,symlinks,tcl)
/usr/lib/rpm/tcl.req: line 3: /usr/bin/tclsh: No such file or directory
/usr/lib/rpm/tcl.req: line 3: exec: /usr/bin/tclsh: cannot execute: No such file or
directory
RPM build errors:
error: /bin/sh failed
error: Failed to find Requires
/bin/sh failed
tcl-snack-2.2.10-alt1
shell.req: /usr/src/tmp/tcl-snack-buildroot/usr/share/tcl/snack2.2.10/demos/mapChan.tcl:
wish8.3 not found (skip)
hasher-priv: master: idle time limit (3600 seconds) exceeded
timetool-2.8-alt7
find-requires: running scripts
(files,lib,pam,perl,pkgconfig,python,shebang,shell,static,symlinks,tcl)
/usr/lib/rpm/tcl.req: line 3: /usr/bin/tclsh: No such file or directory
/usr/lib/rpm/tcl.req: line 3: exec: /usr/bin/tclsh: cannot execute: No such file or
directory
RPM build errors:
error: /bin/sh failed
error: Failed to find Requires
/bin/sh failed
tkeca-4.0.2-alt0.5
find-requires: running scripts
(files,lib,pam,perl,pkgconfig,python,shebang,shell,static,symlinks,tcl)
/usr/lib/rpm/tcl.req: line 3: /usr/bin/tclsh: No such file or directory
/usr/lib/rpm/tcl.req: line 3: exec: /usr/bin/tclsh: cannot execute: No such file or
directory
error: /bin/sh failed
error:
vim-plugin-lh_cpp-ftplugin-20040316-alt1.1
find-requires: running scripts
(files,lib,pam,perl,pkgconfig,python,shebang,shell,static,symlinks,tcl)
/usr/lib/rpm/tcl.req: line 3: /usr/bin/tclsh: No such file or directory
/usr/lib/rpm/tcl.req: line 3: exec: /usr/bin/tclsh: cannot execute: No such file or
directory
error: /bin/sh failed
error:
vtcl-1.6.0-alt1
find-provides: running scripts (alternatives,lib,pam,perl,pkgconfig,python,shell,tcl)
/usr/lib/rpm/tcl.prov: line 3: /usr/bin/tclsh: No such file or directory
/usr/lib/rpm/tcl.prov: line 3: exec: /usr/bin/tclsh: cannot execute: No such file
or directory
RPM build errors:
error: /bin/sh failed
error: Failed to find Provides
/bin/sh failed
wanpipe-3.1.3-alt1
shell.req: /usr/src/tmp/wanpipe-buildroot/etc/wanpipe/lib/x25_lib.sh: menu_name not found
(skip)
/usr/src/tmp/wanpipe-buildroot/etc/wanpipe/samples/redialer: line 17: syntax error near
unexpected token `newline'
/usr/src/tmp/wanpipe-buildroot/etc/wanpipe/samples/redialer: line 17: `PHONE1=<INSERT
PHONE NUMBER>'
error: /bin/sh failed
error:
wbxml2-0.9.2-alt2.svn49synce
find-provides: running scripts (alternatives,lib,pam,perl,pkgconfig,python,shell,tcl)
Package libxml-2.0 was not found in the pkg-config search path.
Perhaps you should add the directory containing `libxml-2.0.pc'
to the PKG_CONFIG_PATH environment variable
Package 'libxml-2.0', required by 'libwbxml2', not found
error: /bin/sh failed
error: Failed to find Provides
RPM build errors:
xmms2-0.2-alt5.DrHouse
pkgconfig.prov: /usr/src/tmp/xmms2-buildroot/usr/lib/pkgconfig/xmms2-client-cpp-glib.pc:
invalid pkg-config output: xmms2-client-cpp-glib = 0.2 DrHouse
error: /bin/sh failed
error:
xorg-x11-proto-devel-7.3.0-alt4
find-provides: running scripts (alternatives,lib,pam,perl,pkgconfig,python,shell,tcl)
Package xau was not found in the pkg-config search path.
Perhaps you should add the directory containing `xau.pc'
to the PKG_CONFIG_PATH environment variable
Package 'xau', required by 'PrintProto', not found
error: /bin/sh failed
error: Failed to find Provides
RPM build errors:
Total 106 error logs.
----------- следующая часть -----------
Было удалено вложение не в текстовом формате...
Имя : =?iso-8859-1?q?=CF=D4=D3=D5=D4=D3=D4=D7=D5=C5=D4?=
Тип : application/pgp-signature
Размер : 189 байтов
Описание: =?iso-8859-1?q?=CF=D4=D3=D5=D4=D3=D4=D7=D5=C5=D4?=
Url : <http://lists.altlinux.org/pipermail/devel/attachments/20070909/76afc568/attachment-0002.bin>
Подробная информация о списке рассылки Devel