[devel] ruby-gnome2-all-0.16.0-alt3: i586 rebuild failed
Alexey Tourbin
at на altlinux.ru
Пт Авг 31 00:14:26 MSD 2007
On Thu, Aug 30, 2007 at 11:53:30PM +0400, Alexey I. Froloff wrote:
> * QA Team Robot <qa@> [070830 23:47]:
> > Package: ruby-gnome2-all-0.16.0-alt3
> > File not found: /usr/src/tmp/ruby-gnome2-all-buildroot/usr/lib/ruby/vendor_ruby/1.8/i586-linux-gnu/glib2.so
> > File not found: /usr/src/tmp/ruby-gnome2-all-buildroot/usr/share/ruby/vendor_ruby/1.8/glib2.rb
> Что это было? Кто сломал глиб?
rbgobj_boxed.c:149: error: argument 'gtype' doesn't match prototype
rbgobject.h:196: error: prototype declaration
rbgtktreeiter.c:23: error: argument 'gtype' doesn't match prototype
rbgtk.h:118: error: prototype declaration
rbgobj_boxed.c:149: error: argument 'gtype' doesn't match prototype
rbgobject.h:196: error: prototype declaration
rbgtktreeiter.c:23: error: argument 'gtype' doesn't match prototype
rbgtk.h:118: error: prototype declaration
Плохо что сборка не сразу обламывается а почему-то идёт до конца.
Хорошо хоть список %files составлен внятно поэтому мы только и знаем,
что на самом деле пакет побился.
----------- следующая часть -----------
Было удалено вложение не в текстовом формате...
Имя : отсутствует
Тип : application/pgp-signature
Размер : 189 байтов
Описание: отсутствует
Url : http://lists.altlinux.org/pipermail/devel/attachments/20070831/b1101d61/attachment.bin
Подробная информация о списке рассылки Devel