[Sisyphus-mipsel-reports] [#104142] sisyphus_mipsel FAILED srpm=glslang-13.1.1-alt2.src.rpm srpm=shaderc-2023.7-alt0.1.src.rpm

Girar awaiter robot awaiter at gyle-secondary.office.basealt.ru
Sun Nov 19 21:37:55 MSK 2023


http://git.altlinux.org/tasks/104142/logs/events.1.1.log

2023-Nov-19 18:36:03 :: shared task #104142 for sisyphus_mipsel started by recycler:
#100 build glslang-13.1.1-alt2.src.rpm
#200 build shaderc-2023.7-alt0.1.src.rpm
2023-Nov-19 18:36:17 :: created build repo
2023-Nov-19 18:36:21 :: [mipsel] #100 glslang-13.1.1-alt2.src.rpm: build start
egrep: warning: egrep is obsolescent; using grep -E
<13>Nov 19 18:37:47 rpmi: libidn2-2.3.4-alt1 sisyphus_mipsel+89682.100.1.1 1667065850 installed
<13>Nov 19 18:37:47 rpmi: libnettle8-3.9.1-alt1 sisyphus_mipsel+97213.100.1.1 1687256980 installed
<13>Nov 19 18:37:47 rpmi: libp11-kit-1:0.25.2-alt1 sisyphus_mipsel+103557.100.1.1 1699091468 installed
<13>Nov 19 18:37:47 rpmi: libtasn1-4.19.0-alt3 sisyphus_mipsel+100262.100.1.1 1692830150 installed
<13>Nov 19 18:37:47 rpmi: libhogweed6-3.9.1-alt1 sisyphus_mipsel+97213.100.1.1 1687256980 installed
<13>Nov 19 18:37:47 rpmi: libgnutls30-3.8.1-alt2 sisyphus_mipsel+99915.100.1.1 1692183992 installed
<13>Nov 19 18:37:47 rpmi: libngtcp2.16-1.0.1-alt1 sisyphus_mipsel+103354.200.1.1 1698744017 installed
<13>Nov 19 18:37:47 rpmi: libngtcp2_crypto_gnutls8-1.0.1-alt1 sisyphus_mipsel+103354.200.1.1 1698744017 installed
<13>Nov 19 18:37:47 rpmi: rpm-macros-cmake-3.27.7-alt1 sisyphus_mipsel+102935.100.1.1 1698130114 installed
<13>Nov 19 18:37:48 rpmi: cmake-modules-3.27.7-alt1 sisyphus_mipsel+102935.100.1.1 1698130114 installed
<13>Nov 19 18:37:48 rpmi: libuv-1.46.0-alt1 sisyphus_mipsel+99198.100.1.1 1690721534 installed
<13>Nov 19 18:37:48 rpmi: librhash-1.3.5-alt3 sisyphus_mipsel+71917.100.1.1 1632988041 installed
<13>Nov 19 18:37:48 rpmi: libjsoncpp24-1.9.4-alt2 sisyphus_mipsel+72120.100.1.1 1633449829 installed
<13>Nov 19 18:37:48 rpmi: libexpat-2.5.0-alt1 sisyphus_mipsel+89790.100.1.1 1667138163 installed
<13>Nov 19 18:37:48 rpmi: publicsuffix-list-dafsa-20231026-alt1 sisyphus_mipsel+103228.100.1.1 1698634870 installed
<13>Nov 19 18:37:48 rpmi: libpsl-0.21.2-alt1 sisyphus_mipsel+91721.100.1.1 1672177382 installed
<13>Nov 19 18:37:48 rpmi: libnghttp3.9-1.0.0-alt1 sisyphus_mipsel+103354.100.1.1 1698743733 installed
<13>Nov 19 18:37:48 rpmi: libnghttp2-1.57.0-alt1 sisyphus_mipsel+102401.100.1.1 1697070572 installed
<13>Nov 19 18:37:48 rpmi: openldap-common-2.4.59-alt1 sisyphus_mipsel+98795.100.1.1 1689977620 installed
<13>Nov 19 18:37:48 rpmi: libntlm-1.5-alt1 sisyphus_mipsel+66471.3300.1.1 1626639723 installed
<13>Nov 19 18:37:48 rpmi: libidn-1.37-alt2 sisyphus_mipsel+82527.100.1.1 1653812320 installed
<13>Nov 19 18:37:48 rpmi: libverto-0.3.2-alt1_1 sisyphus_mipsel+96809.1600.1.1 1684917986 installed
<13>Nov 19 18:37:48 rpmi: liblmdb-0.9.29-alt1.1 sisyphus_mipsel+88129.100.1.1 1663221557 installed
<13>Nov 19 18:37:48 rpmi: libkeyutils-1.6.3-alt1 sisyphus_mipsel+56970.100.1.1 1613265640 installed
<13>Nov 19 18:37:48 rpmi: libcom_err-1.46.4.0.5.4cda-alt1 sisyphus_mipsel+70343.100.2.1 1630190979 installed
<13>Nov 19 18:37:48 rpmi: libbrotlicommon-1.1.0-alt1 sisyphus_mipsel+100664.100.1.1 1693854907 installed
<13>Nov 19 18:37:48 rpmi: libbrotlidec-1.1.0-alt1 sisyphus_mipsel+100664.100.1.1 1693854907 installed
<13>Nov 19 18:37:48 rpmi: rpm-macros-alternatives-0.5.2-alt2 sisyphus_mipsel+93335.100.1.1 1676504549 installed
<13>Nov 19 18:37:48 rpmi: alternatives-0.5.2-alt2 sisyphus_mipsel+93335.100.1.1 1676504549 installed
<13>Nov 19 18:37:48 rpmi: ca-certificates-2023.07.31-alt1 sisyphus_mipsel+99316.200.1.1 1690948755 installed
<13>Nov 19 18:37:48 rpmi: ca-trust-0.1.4-alt1 sisyphus_mipsel+89452.100.1.1 1666219028 installed
<13>Nov 19 18:37:48 rpmi: p11-kit-trust-1:0.25.2-alt1 sisyphus_mipsel+103557.100.1.1 1699091468 installed
<13>Nov 19 18:37:48 rpmi: libcrypto3-3.1.4-alt1 sisyphus_mipsel+103102.100.1.1 1698460703 installed
<13>Nov 19 18:37:48 rpmi: libssl3-3.1.4-alt1 sisyphus_mipsel+103102.100.1.1 1698460703 installed
<86>Nov 19 18:37:48 groupadd[22563]: group added to /etc/group: name=_keytab, GID=999
<86>Nov 19 18:37:48 groupadd[22563]: group added to /etc/gshadow: name=_keytab
<86>Nov 19 18:37:48 groupadd[22563]: new group: name=_keytab, GID=999
<13>Nov 19 18:37:49 rpmi: libkrb5-1.21.2-alt1 sisyphus_mipsel+99926.100.1.1 1692249107 installed
<13>Nov 19 18:37:49 rpmi: libgsasl-2.2.0-alt1 sisyphus_mipsel+103403.100.1.1 1699005861 installed
<86>Nov 19 18:37:49 groupadd[22570]: group added to /etc/group: name=sasl, GID=998
<86>Nov 19 18:37:49 groupadd[22570]: group added to /etc/gshadow: name=sasl
<86>Nov 19 18:37:49 groupadd[22570]: new group: name=sasl, GID=998
<13>Nov 19 18:37:49 rpmi: libsasl2-3-2.1.27-alt2.2 sisyphus_mipsel+98580.5000.2.1 1689700871 installed
<13>Nov 19 18:37:49 rpmi: libldap-2.4.59-alt1 sisyphus_mipsel+98795.100.1.1 1689977620 installed
<13>Nov 19 18:37:49 rpmi: libarchive13-3.6.1-alt2 sisyphus_mipsel+98580.1000.2.1 1689663949 installed
<13>Nov 19 18:37:49 rpmi: libssh2-1.11.0-alt1 sisyphus_mipsel+100158.100.1.1 1692650560 installed
<13>Nov 19 18:37:49 rpmi: libcurl-8.4.0-alt1 sisyphus_mipsel+103403.200.1.1 1699008061 installed
<13>Nov 19 18:37:50 rpmi: cmake-3.27.7-alt1 sisyphus_mipsel+102935.100.1.1 1698130114 installed
Reading Package Lists...
Building Dependency Tree...
MI2a: marked for install (shallow): gcc-c++
MI2a:  satisfying Depends: gcc10-c++  (NULL)
MI2a:   maybe install (a direct target): gcc10-c++ 10.3.1-alt6.0.mips1:sisyphus_mipsel+71888.100.1.1 at 1632916341
MI2a:  target SELECTED: gcc10-c++ 10.3.1-alt6.0.mips1:sisyphus_mipsel+71888.100.1.1 at 1632916341
MI2a:  requesting to install gcc10-c++ (unspec'd ver; inspect with Debug::pkgMark-shallow)
MI2a:    marked for install (shallow): gcc10-c++
MI2a:     satisfying PreDepends: gcc-c++-common >= 1.4.7
MI2a:      maybe install (a direct target): gcc-c++-common 1.4.27-alt1:sisyphus_mipsel+66465.1300.1.1 at 1626607554
MI2a:     target SELECTED: gcc-c++-common 1.4.27-alt1:sisyphus_mipsel+66465.1300.1.1 at 1626607554
MI2a:     requesting to install gcc-c++-common (unspec'd ver; inspect with Debug::pkgMark-shallow)
MI2a:       marked for install (shallow): gcc-c++-common
MI2a:     satisfying Depends: libstdc++10-devel = 10.3.1-alt6.0.mips1
MI2a:      maybe install (a direct target): libstdc++10-devel 10.3.1-alt6.0.mips1:sisyphus_mipsel+71888.100.1.1 at 1632916341
MI2a:     target SELECTED: libstdc++10-devel 10.3.1-alt6.0.mips1:sisyphus_mipsel+71888.100.1.1 at 1632916341
MI2a:     requesting to install libstdc++10-devel (unspec'd ver; inspect with Debug::pkgMark-shallow)
MI2a:       marked for install (shallow): libstdc++10-devel
MI2a: marked for install (shallow): python3-dev
MI2a:  satisfying Depends: rpm-build-python3 >= 0.1.9
MI2a:   maybe install (a direct target): rpm-build-python3 0.1.24-alt2:sisyphus_mipsel+102310.100.1.1 at 1696920258
MI2a:  target SELECTED: rpm-build-python3 0.1.24-alt2:sisyphus_mipsel+102310.100.1.1 at 1696920258
MI2a:  requesting to install rpm-build-python3 (unspec'd ver; inspect with Debug::pkgMark-shallow)
MI2a:    marked for install (shallow): rpm-build-python3
MI2a:     satisfying Depends: /usr/lib/rpm/python3-site-packages-files.req.list  (NULL)
MI2a:      maybe install (a providing target): python3-base 3.11.6-alt1:sisyphus_mipsel+102251.100.1.1 at 1696822544
MI2a:     target SELECTED: python3-base 3.11.6-alt1:sisyphus_mipsel+102251.100.1.1 at 1696822544
MI2a:     requesting to install python3-base (unspec'd ver; inspect with Debug::pkgMark-shallow)
MI2a:       marked for install (shallow): python3-base
MI2a:        satisfying Depends: libb2.so.1 >= set:ifZigOjACtTxPlFd1
MI2a:         maybe install (a providing target): libb2 0.98.1-alt1_1:sisyphus_mipsel+74476.100.1.1 at 1638964458
MI2a:        target SELECTED: libb2 0.98.1-alt1_1:sisyphus_mipsel+74476.100.1.1 at 1638964458
MI2a:        requesting to install libb2 (unspec'd ver; inspect with Debug::pkgMark-shallow)
MI2a:          marked for install (shallow): libb2
MI2a:        satisfying Depends: libgdbm.so.3 >= set:iejT6M96OmuT9HlYJ7ooGKIqQHH2
MI2a:         maybe install (a providing target): libgdbm 1.8.3-alt10:sisyphus_mipsel+66471.1600.1.1 at 1626638557
MI2a:        target SELECTED: libgdbm 1.8.3-alt10:sisyphus_mipsel+66471.1600.1.1 at 1626638557
MI2a:        requesting to install libgdbm (unspec'd ver; inspect with Debug::pkgMark-shallow)
MI2a:          marked for install (shallow): libgdbm
MI2a:        satisfying Depends: libmpdec.so.3 >= set:mfKMM5WSnhLDPZvFmnT3UZzrmq8c8YrwNbOV4tWrYtxVLhVcTOCZFhcz3lEuvZcwi6sdFMWETo2ULsys4nYlIRp5HZ2ffD2WeZASSTvczNcrykpViVwdfVL0tmffEEMXz365djtoYzTFzMebqqvYejutWDL4iBFP4DZFz95ekTiFkNlEgOfZbzZAVw77cJS8N8NLq7Xj1XrYJOufSLenVyExgbjfSYF9OtF8u2gC6g0GdyiHcFO9CztZ9gC7OBZzxibA5aSk7Oeqpq1
MI2a:         maybe install (a providing target): libmpdec3 2.5.1-alt3:sisyphus_mipsel+92946.100.1.1 at 1675621075
MI2a:        target SELECTED: libmpdec3 2.5.1-alt3:sisyphus_mipsel+92946.100.1.1 at 1675621075
MI2a:        requesting to install libmpdec3 (unspec'd ver; inspect with Debug::pkgMark-shallow)
MI2a:          marked for install (shallow): libmpdec3
MI2a:        satisfying Depends: python3 = 3.11.6-alt1:sisyphus_mipsel+102251.100.1.1
MI2a:         maybe install (a direct target): python3 3.11.6-alt1:sisyphus_mipsel+102251.100.1.1 at 1696822544
MI2a:        target SELECTED: python3 3.11.6-alt1:sisyphus_mipsel+102251.100.1.1 at 1696822544
MI2a:        requesting to install python3 (unspec'd ver; inspect with Debug::pkgMark-shallow)
MI2a:          marked for install (shallow): python3
MI2a:     satisfying Depends: python3(py3dephell.py3prov) < 0
MI2a:      maybe install (a providing target): python3-module-py3dephell 0.1.0-alt2:sisyphus_mipsel+100695.100.1.1 at 1693874051
MI2a:     target SELECTED: python3-module-py3dephell 0.1.0-alt2:sisyphus_mipsel+100695.100.1.1 at 1693874051
MI2a:     requesting to install python3-module-py3dephell (unspec'd ver; inspect with Debug::pkgMark-shallow)
MI2a:       marked for install (shallow): python3-module-py3dephell
MI2a:     satisfying Depends: tests-for-installed-python3-pkgs = 0.1.24-alt2:sisyphus_mipsel+102310.100.1.1
MI2a:      maybe install (a direct target): tests-for-installed-python3-pkgs 0.1.24-alt2:sisyphus_mipsel+102310.100.1.1 at 1696920258
MI2a:     target SELECTED: tests-for-installed-python3-pkgs 0.1.24-alt2:sisyphus_mipsel+102310.100.1.1 at 1696920258
MI2a:     requesting to install tests-for-installed-python3-pkgs (unspec'd ver; inspect with Debug::pkgMark-shallow)
MI2a:       marked for install (shallow): tests-for-installed-python3-pkgs
MI2a:  satisfying Depends: libncurses-devel  (NULL)
MI2a:   maybe install (a direct target): libncurses-devel 6.3.20220618-alt4:sisyphus_mipsel+100373.100.1.1 at 1693237345
MI2a:  target SELECTED: libncurses-devel 6.3.20220618-alt4:sisyphus_mipsel+100373.100.1.1 at 1693237345
MI2a:  requesting to install libncurses-devel (unspec'd ver; inspect with Debug::pkgMark-shallow)
MI2a:    marked for install (shallow): libncurses-devel
MI2a:     satisfying Depends: libtinfo-devel = 6.3.20220618-alt4:sisyphus_mipsel+100373.100.1.1
MI2a:      maybe install (a direct target): libtinfo-devel 6.3.20220618-alt4:sisyphus_mipsel+100373.100.1.1 at 1693237345
MI2a:     target SELECTED: libtinfo-devel 6.3.20220618-alt4:sisyphus_mipsel+100373.100.1.1 at 1693237345
MI2a:     requesting to install libtinfo-devel (unspec'd ver; inspect with Debug::pkgMark-shallow)
MI2a:       marked for install (shallow): libtinfo-devel
MI2a:     satisfying Depends: libncurses6 = 6.3.20220618-alt4:sisyphus_mipsel+100373.100.1.1
MI2a:      maybe install (a direct target): libncurses6 6.3.20220618-alt4:sisyphus_mipsel+100373.100.1.1 at 1693237345
MI2a:     target SELECTED: libncurses6 6.3.20220618-alt4:sisyphus_mipsel+100373.100.1.1 at 1693237345
MI2a:     requesting to install libncurses6 (unspec'd ver; inspect with Debug::pkgMark-shallow)
MI2a:       marked for install (shallow): libncurses6
MI2a:  satisfying Depends: libpython3 = 3.11.6-alt1:sisyphus_mipsel+102251.100.1.1
MI2a:   maybe install (a direct target): libpython3 3.11.6-alt1:sisyphus_mipsel+102251.100.1.1 at 1696822544
MI2a:  target SELECTED: libpython3 3.11.6-alt1:sisyphus_mipsel+102251.100.1.1 at 1696822544
MI2a:  requesting to install libpython3 (unspec'd ver; inspect with Debug::pkgMark-shallow)
MI2a:    marked for install (shallow): libpython3
cmake is already the newest version.
Selecting python3-dev for 'python3-devel'
W: pkgMakeStatusCache: The configured APT::Cache-Limit (134217728) is below the recommended default value (167772160). Remove it to use the default.
W: You may want to run apt-get update to correct these problems
E: Version >='2023.5' for 'libspirv-tools-devel' was not found
hsh-install: Failed to calculate package file list.
hsh-install: Failed to generate package file list.
2023-Nov-19 18:37:54 :: [mipsel] glslang-13.1.1-alt2.src.rpm: remote: cannot build src.rpm
2023-Nov-19 18:37:54 :: [mipsel] #100 glslang-13.1.1-alt2.src.rpm: build FAILED
2023-Nov-19 18:37:54 :: [mipsel] requesting cancellation of task processing
2023-Nov-19 18:37:54 :: [mipsel] build FAILED
2023-Nov-19 18:37:54 :: task #104142 for sisyphus_mipsel FAILED


More information about the Sisyphus-mipsel-reports mailing list