[Sisyphus-mipsel-reports] [#100238] sisyphus_mipsel FAILED srpm=zabbix-6.0.21-alt1.src.rpm

Girar awaiter robot awaiter at gyle-secondary.office.basealt.ru
Wed Aug 23 13:41:35 MSK 2023


http://git.altlinux.org/tasks/100238/logs/events.1.1.log

2023-Aug-23 10:10:35 :: shared task #100238 for sisyphus_mipsel started by recycler:
#100 build zabbix-6.0.21-alt1.src.rpm
2023-Aug-23 10:10:36 :: [mipsel] #100 zabbix-6.0.21-alt1.src.rpm: build start
package zabbix.com/cmd/zabbix_agent2
	imports zabbix.com/pkg/tls: build constraints exclude all Go files in /usr/src/RPM/BUILD/zabbix-6.0.21/src/go/pkg/tls
package zabbix.com/cmd/zabbix_agent2
	imports zabbix.com/pkg/zbxlib: build constraints exclude all Go files in /usr/src/RPM/BUILD/zabbix-6.0.21/src/go/pkg/zbxlib
make[2]: *** [Makefile:621: zabbix.com/cmd/zabbix_agent2] Error 1
make[2]: Leaving directory '/usr/src/RPM/BUILD/zabbix-6.0.21/src/go'
make[1]: *** [Makefile:511: all-recursive] Error 1
make[1]: Leaving directory '/usr/src/RPM/BUILD/zabbix-6.0.21/src'
make: *** [Makefile:547: all-recursive] Error 1
make: Leaving directory '/usr/src/RPM/BUILD/zabbix-6.0.21'
2023-Aug-23 10:41:34 :: [mipsel] zabbix-6.0.21-alt1.src.rpm: remote: build failed
2023-Aug-23 10:41:34 :: [mipsel] #100 zabbix-6.0.21-alt1.src.rpm: build FAILED
2023-Aug-23 10:41:35 :: [mipsel] requesting cancellation of task processing
2023-Aug-23 10:41:35 :: [mipsel] build FAILED
2023-Aug-23 10:41:35 :: task #100238 for sisyphus_mipsel FAILED


More information about the Sisyphus-mipsel-reports mailing list