[#65857] t6 FAILED copy=cpufreq-simple copy=kernel-image-un-def ...

Girar Builder robot girar-builder at altlinux.org
Wed Mar 7 12:58:38 MSK 2012


http://git.altlinux.org/tasks/65857/logs/events.1.1.log

2012-Mar-07 12:56:43 :: task #65857 for t6 started by viy:
#100 copy cpufreq-simple from p6
#200 copy kernel-image-un-def from p6
#300 copy kernel-modules-acpi_call-un-def from p6
#400 copy kernel-modules-asix-un-def from p6
#500 copy kernel-modules-bbswitch-un-def from p6
#600 copy kernel-modules-bcmwl-un-def from p6
#700 copy kernel-modules-dahdi-un-def from p6
#1000 copy kernel-modules-lsadrv-un-def from p6
#1100 copy kernel-modules-nvidia-un-def from p6
#1200 copy kernel-modules-tp_smapi-un-def from p6
#1300 copy kernel-modules-u200-un-def from p6
#1400 copy kernel-modules-vhba-un-def from p6
#1500 copy kernel-modules-virtualbox-addition-un-def from p6
#1600 copy kernel-modules-virtualbox-un-def from p6
#1700 copy kernel-modules-xtables-addons-un-def from p6
2012-Mar-07 12:56:44 :: cloned t6
2012-Mar-07 12:56:46 :: copy from `p6': cpufreq-simple-0.1.4-alt1.src.rpm
2012-Mar-07 12:56:55 :: copy from `p6': kernel-image-un-def-3.2.9-alt0.M60P.2.src.rpm
2012-Mar-07 12:56:56 :: copy from `p6': kernel-modules-acpi_call-un-def-0.1-alt2.197129.0.M60P.2.src.rpm
2012-Mar-07 12:56:57 :: copy from `p6': kernel-modules-asix-un-def-1.0.4.1.0-alt2.197129.0.M60P.2.src.rpm
2012-Mar-07 12:56:59 :: copy from `p6': kernel-modules-bbswitch-un-def-0.4.1-alt2.197129.0.M60P.2.src.rpm
2012-Mar-07 12:57:00 :: copy from `p6': kernel-modules-bcmwl-un-def-5.100.82.112-alt2.197129.0.M60P.2.src.rpm
2012-Mar-07 12:57:01 :: copy from `p6': kernel-modules-dahdi-un-def-2.5.0.2-alt2.197129.0.M60P.2.src.rpm
2012-Mar-07 12:57:03 :: copy from `p6': kernel-modules-lsadrv-un-def-2.0.1-alt1.197129.0.M60P.2.src.rpm
2012-Mar-07 12:57:09 :: copy from `p6': kernel-modules-nvidia-un-def-285.05.09-alt1.197129.0.M60P.2.src.rpm
2012-Mar-07 12:57:11 :: copy from `p6': kernel-modules-tp_smapi-un-def-0.40-alt2.197129.0.M60P.2.src.rpm
2012-Mar-07 12:57:12 :: copy from `p6': kernel-modules-u200-un-def-1.0.1.0-alt2.197129.0.M60P.2.src.rpm
2012-Mar-07 12:57:13 :: copy from `p6': kernel-modules-vhba-un-def-20110915-alt4.197129.0.M60P.2.src.rpm
2012-Mar-07 12:57:14 :: copy from `p6': kernel-modules-virtualbox-addition-un-def-4.1.4-alt3.197129.0.M60P.2.src.rpm
2012-Mar-07 12:57:16 :: copy from `p6': kernel-modules-virtualbox-un-def-4.1.4-alt2.197129.0.M60P.2.src.rpm
2012-Mar-07 12:57:17 :: copy from `p6': kernel-modules-xtables-addons-un-def-1.39-alt3.197129.0.M60P.2.src.rpm
2012-Mar-07 12:58:02 :: build check OK
warning (#200): kernel-doc-un-3.2.9-alt0.M60P.2.i586.rpm should be .noarch.rpm
warning (#200): kernel-headers-un-def-3.2.9-alt0.M60P.2.i586.rpm should be .noarch.rpm
2012-Mar-07 12:58:35 :: noarch check OK
 *** new and existing source packages have the same filename
cpufreq-simple	cpufreq-simple-0.1.4-alt1.src.rpm
 *** new and existing binary packages have the same filename
cpufreq-simple	cpufreq-simple-0.1.4-alt1.noarch.rpm
 *** binary package version is either the same or older than existing
cpufreq-simple	0.1.4-alt1	0.1.4-alt1
2012-Mar-07 12:58:37 :: version check FAILED
2012-Mar-07 12:58:37 :: task #65857 for t6 FAILED


More information about the Sisyphus-incominger mailing list