[#328940] [test-only] p10 FAILED (try 4) python3-module-importlib-resources.git=5.10.0-alt1 ...

Girar awaiter (antohami) girar-builder at altlinux.org
Sun Sep 10 10:36:19 MSK 2023


https://git.altlinux.org/tasks/328940/logs/events.4.1.log

subtask  name                                aarch64  armh    i586  ppc64le  x86_64
    #70  python3-module-importlib-resources       49  1:12      32       53      27
   #200  chirp                                failed     ?  failed   failed  failed

2023-Sep-10 07:33:40 :: test-only task #328940 for p10 resumed by antohami:
#40 removed
#60 removed
#70 build 5.10.0-alt1 from /gears/p/python3-module-importlib-resources.git fetched at 2023-Sep-10 07:33:28
#100 build 1.15.1-alt1 from /gears/p/python3-module-yattag.git fetched at 2023-Sep-07 17:43:29 from sisyphus
#200 build 20230906-alt1 from /people/antohami/packages/chirp.git fetched at 2023-Sep-07 17:43:48
2023-Sep-10 07:33:40 :: created build repo
2023-Sep-10 07:33:42 :: [x86_64] #70 python3-module-importlib-resources.git 5.10.0-alt1: build start
2023-Sep-10 07:33:42 :: [aarch64] #70 python3-module-importlib-resources.git 5.10.0-alt1: build start
2023-Sep-10 07:33:42 :: [i586] #70 python3-module-importlib-resources.git 5.10.0-alt1: build start
2023-Sep-10 07:33:42 :: [ppc64le] #70 python3-module-importlib-resources.git 5.10.0-alt1: build start
2023-Sep-10 07:33:42 :: [armh] #70 python3-module-importlib-resources.git 5.10.0-alt1: build start
2023-Sep-10 07:34:09 :: [x86_64] #70 python3-module-importlib-resources.git 5.10.0-alt1: build OK
2023-Sep-10 07:34:10 :: [x86_64] #100 python3-module-yattag.git 1.15.1-alt1: build start
2023-Sep-10 07:34:14 :: [i586] #70 python3-module-importlib-resources.git 5.10.0-alt1: build OK
2023-Sep-10 07:34:14 :: [i586] #100 python3-module-yattag.git 1.15.1-alt1: build start
2023-Sep-10 07:34:19 :: [x86_64] #100 python3-module-yattag.git 1.15.1-alt1: build OK (cached)
2023-Sep-10 07:34:19 :: [x86_64] #200 chirp.git 20230906-alt1: build start
2023-Sep-10 07:34:25 :: [i586] #100 python3-module-yattag.git 1.15.1-alt1: build OK (cached)
2023-Sep-10 07:34:25 :: [i586] #200 chirp.git 20230906-alt1: build start
2023-Sep-10 07:34:31 :: [aarch64] #70 python3-module-importlib-resources.git 5.10.0-alt1: build OK
2023-Sep-10 07:34:31 :: [aarch64] #100 python3-module-yattag.git 1.15.1-alt1: build start
2023-Sep-10 07:34:35 :: [ppc64le] #70 python3-module-importlib-resources.git 5.10.0-alt1: build OK
2023-Sep-10 07:34:36 :: [ppc64le] #100 python3-module-yattag.git 1.15.1-alt1: build start
2023-Sep-10 07:34:49 :: [aarch64] #100 python3-module-yattag.git 1.15.1-alt1: build OK (cached)
2023-Sep-10 07:34:50 :: [aarch64] #200 chirp.git 20230906-alt1: build start
2023-Sep-10 07:34:54 :: [armh] #70 python3-module-importlib-resources.git 5.10.0-alt1: build OK
2023-Sep-10 07:34:54 :: [armh] #100 python3-module-yattag.git 1.15.1-alt1: build start
2023-Sep-10 07:34:57 :: [ppc64le] #100 python3-module-yattag.git 1.15.1-alt1: build OK (cached)
2023-Sep-10 07:34:57 :: [ppc64le] #200 chirp.git 20230906-alt1: build start
[x86_64] Requirement already satisfied: yattag in /usr/lib/python3/site-packages (from chirp==0) (1.15.1)
[x86_64] ERROR: Could not find a version that satisfies the requirement importlib-resources (from chirp) (from versions: none)
[x86_64] ERROR: No matching distribution found for importlib-resources
[x86_64] ERROR: invocation failed (exit code 1)
[x86_64] py3 finish: installpkg /usr/src/RPM/BUILD/chirp-20230906/.tox/.tmp/package/1/chirp-0.zip after 1.59 seconds
[x86_64] ___________________________________ summary ____________________________________
[x86_64] ERROR:   py3: InvocationError for command /usr/src/RPM/BUILD/chirp-20230906/.tox/py3/bin/python -m pip install --exists-action w .tox/.tmp/package/1/chirp-0.zip (exited with code 1)
[x86_64] cleanup /usr/src/RPM/BUILD/chirp-20230906/.tox/.tmp/package/1/chirp-0.zip
2023-Sep-10 07:35:08 :: [x86_64] chirp.git 20230906-alt1: remote: build failed
2023-Sep-10 07:35:08 :: [x86_64] #200 chirp.git 20230906-alt1: build FAILED
2023-Sep-10 07:35:08 :: [x86_64] requesting cancellation of task processing
2023-Sep-10 07:35:22 :: [armh] #100 python3-module-yattag.git 1.15.1-alt1: build OK (cached)
2023-Sep-10 07:35:22 :: [armh] task processing CANCELLED
[i586] Requirement already satisfied: yattag in /usr/lib/python3/site-packages (from chirp==0) (1.15.1)
[i586] ERROR: Could not find a version that satisfies the requirement importlib-resources (from chirp) (from versions: none)
[i586] ERROR: No matching distribution found for importlib-resources
[i586] ERROR: invocation failed (exit code 1)
[i586] py3 finish: installpkg /usr/src/RPM/BUILD/chirp-20230906/.tox/.tmp/package/1/chirp-0.zip after 1.19 seconds
[i586] ___________________________________ summary ____________________________________
[i586] ERROR:   py3: InvocationError for command /usr/src/RPM/BUILD/chirp-20230906/.tox/py3/bin/python -m pip install --exists-action w .tox/.tmp/package/1/chirp-0.zip (exited with code 1)
[i586] cleanup /usr/src/RPM/BUILD/chirp-20230906/.tox/.tmp/package/1/chirp-0.zip
2023-Sep-10 07:35:26 :: [i586] chirp.git 20230906-alt1: remote: build failed
2023-Sep-10 07:35:26 :: [i586] #200 chirp.git 20230906-alt1: build FAILED
[aarch64] Requirement already satisfied: yattag in /usr/lib/python3/site-packages (from chirp==0) (1.15.1)
[aarch64] ERROR: Could not find a version that satisfies the requirement importlib-resources (from chirp) (from versions: none)
[aarch64] ERROR: No matching distribution found for importlib-resources
[aarch64] ERROR: invocation failed (exit code 1)
[aarch64] py3 finish: installpkg /usr/src/RPM/BUILD/chirp-20230906/.tox/.tmp/package/1/chirp-0.zip after 1.93 seconds
[aarch64] ___________________________________ summary ____________________________________
[aarch64] ERROR:   py3: InvocationError for command /usr/src/RPM/BUILD/chirp-20230906/.tox/py3/bin/python -m pip install --exists-action w .tox/.tmp/package/1/chirp-0.zip (exited with code 1)
[aarch64] cleanup /usr/src/RPM/BUILD/chirp-20230906/.tox/.tmp/package/1/chirp-0.zip
2023-Sep-10 07:36:00 :: [aarch64] chirp.git 20230906-alt1: remote: build failed
2023-Sep-10 07:36:00 :: [aarch64] #200 chirp.git 20230906-alt1: build FAILED
[ppc64le] Requirement already satisfied: yattag in /usr/lib/python3/site-packages (from chirp==0) (1.15.1)
[ppc64le] ERROR: Could not find a version that satisfies the requirement importlib-resources (from chirp) (from versions: none)
[ppc64le] ERROR: No matching distribution found for importlib-resources
[ppc64le] ERROR: invocation failed (exit code 1)
[ppc64le] py3 finish: installpkg /usr/src/RPM/BUILD/chirp-20230906/.tox/.tmp/package/1/chirp-0.zip after 2.18 seconds
[ppc64le] ___________________________________ summary ____________________________________
[ppc64le] ERROR:   py3: InvocationError for command /usr/src/RPM/BUILD/chirp-20230906/.tox/py3/bin/python -m pip install --exists-action w .tox/.tmp/package/1/chirp-0.zip (exited with code 1)
[ppc64le] cleanup /usr/src/RPM/BUILD/chirp-20230906/.tox/.tmp/package/1/chirp-0.zip
2023-Sep-10 07:36:19 :: [ppc64le] chirp.git 20230906-alt1: remote: build failed
2023-Sep-10 07:36:19 :: [ppc64le] #200 chirp.git 20230906-alt1: build FAILED
2023-Sep-10 07:35:08 :: [x86_64] build FAILED
2023-Sep-10 07:35:22 :: [armh] build FAILED
2023-Sep-10 07:35:26 :: [i586] build FAILED
2023-Sep-10 07:36:00 :: [aarch64] build FAILED
2023-Sep-10 07:36:19 :: [ppc64le] build FAILED
2023-Sep-10 07:36:19 :: task #328940 for p10 FAILED


More information about the Girar-builder-p10 mailing list